FW: SSE register return with SSE disabled, magma, x86_64

Paolo Mantegazza mantegazza at aero.polimi.it
Fri Mar 16 16:09:22 CET 2007


Xiaofeng Gao wrote:
> Hello, Paul, Paul-Newbie and Paolo
> 
> Many thanks for your replies.
> 
> For using our other software routines in my data acquisition system, I need to have gcc >= 4,  
> We had some problem using the version from FC, which produces some wired characters in error messages. That is why I start to use standard gcc.
> 
> 
> Since I don't use FPU in my driver at present, once I de-select FPU during RTAI config,
> 

Do not disable that but only "math supprt" in "other features" of "base 
system", which shoudl be the default with magma now.

>  "make" and "make install" have no problem.
> 
> However,  when I tried testsuits to see if RTAI works, the test failed. Rtai modules can not be loaded into kernel. 
> 
> For example:
> { 
> [root at sc2hawaii bin]# cd /usr/src/rtai_install/testsuite/user
> [root at sc2hawaii user]# cd latency/
> [root at sc2hawaii latency]# ./run
> *
> *
> * Type ^C to stop this application.
> *
> *
> insmod: error inserting '/usr/src/rtai_install/modules/rtai_hal.ko': -1 Unknown symbol in module
> ERROR: cannot load /usr/src/rtai_install/modules/rtai_hal.ko
> /usr/src/rtai_install/bin/rtai-load: line 185:  9936 Segmentation fault      $suflag $*
> /usr/src/rtai_install/bin/rtai-load: line 185:  9965 Segmentation fault      $suflag $*
> }
> 
> Dmesg shows
> {
> rtai_hal: Unknown symbol ipipe_irq_handler
> rtai_hal: Unknown symbol __ipipe_tick_regs
> rtai_hal: Unknown symbol per_cpu__vector_irq
> rtai_hal: Unknown symbol __ipipe_sync_stage
> rtai_hal: Unknown symbol idt_table
> latency[9936] general protection rip:40086b rsp:7ffff4814f28 error:7b2
> display[9965] general protection rip:40093b rsp:7fff9cee7148 error:7b2
> }
> 
> Is there something I missed here?  
> 

The faulting is clear because you have none of rtai installed. The 
reason of missing symbols is not. Just to be sure I've remado my 
installation with the distributed patch and is OK. Those symbole are 
esplicitely exported by the patch. You should check 
"arch/x86-64/kernel/ipipe.c" for the related EXPORT_SYMBOL toward the 
end of that file. Are you sure you used the right hal patch from magma?

Paolo.

> Attached is the building log
> 
> My PC is SMP, but all _up, _smp and _mup are linked to
> {
> /usr/src/rtai_install/modules
> 
> lrwxrwxrwx 1 root root      12 Mar 15 14:16 rtai_mup.ko -> rtai_lxrt.ko
> lrwxrwxrwx 1 root root      12 Mar 15 14:16 rtai_sched.ko -> rtai_lxrt.ko
> lrwxrwxrwx 1 root root      12 Mar 15 14:16 rtai_smp.ko -> rtai_lxrt.ko
> lrwxrwxrwx 1 root root      12 Mar 15 14:16 rtai_up.ko -> rtai_lxrt.ko
> }
> 
> 
> One thing I noticed is that information in rtai-config.l.og about gcc ( gcc 4.0.3 )
> is different from rtio-info script ( gcc 4.1.1). 
> 
> When I tpye "which gcc" from prompt, it correctly point to gcc 4.0.3 and 
> my kernel is built with gcc 4.0.3
>   
> 
> Many thanks for any suggestion
> 
> 
> Xiaofeng Gao	
> 
> 
>>-----Original Message-----
>>From: Paolo Mantegazza [mailto:mantegazza at aero.polimi.it] 
>>Sent: 15 March 2007 22:46
>>To: Paul
>>Cc: Paul Regnier; Xiaofeng Gao; Paolo Mantegazza
>>Subject: Re: FW: SSE register return with SSE disabled, magma, x86_64
>>
>>
>>Paul wrote:
>>
>>>Hi Paolo
>>>
>>>On Thursday 15 March 2007 21:08, Paolo Mantegazza wrote:
>>>
>>>
>>>>Well I'm still using the very first machine in which x86_64 
>>
>>has worked
>>
>>>>  with rtai, albeit UP only, for 2 year and it is based on 
>>
>>suse-3.2 
>>
>>>>and gcc-3.4. What is the extended caption of the error. Do you have 
>>>>any idea of waht is the fix? I'm lazy and I would like to 
>>
>>have not to 
>>
>>>>install a gcc-4.xx compiler on that machine for a while.
>>>
>>>
>>>The full text (compiled with `make V=1`) of the fatal error is:
>>>
>>>make -f scripts/Makefile.build obj=/tmp/Rtai/magma/base/math
>>>  
>>>gcc -Wp,-MD,/tmp/Rtai/magma/base/math/.e_acos.o.d  
>>
>>-nostdinc -isystem 
>>/usr/lib/gcc/x86_64-linux-gnu/4.1.2/include -D__KERNEL__ 
>>-Iinclude  -include 
>>
>>>include/linux/autoconf.h -Wall -Wundef -Wstrict-prototypes 
>>
>>-Wno-trigraphs -fno-strict-aliasing -fno-common -O2   -m64 
>>-mno-red-zone -mcmodel=kernel -pipe -fno-reorder-blocks 
>>-Wno-sign-compare -fno-asynchronous-unwind-tables 
>>-funit-at-a-time -mno-sse -mno-mmx -mno-sse2 -mno-3dnow 
>>-maccumulate-outgoing-args -DCONFIG_AS_CFI=1 
>>-DCONFIG_AS_CFI_SIGNAL_FRAME=1 -fno-omit-frame-pointer 
>>-fno-optimize-sibling-calls  -fno-stack-protector 
>>-Wdeclaration-after-statement -Wno-pointer-sign 
>>-I/tmp/Rtai/magma/base/include 
>>-I/tmp/Rtai/magma/base/math/../include 
>>-I/tmp/Rtai/magma/base/math/../.. -I/usr/include 
>>-D_FORTIFY_SOURCE=0 -ffast-math -mhard-float -D_IEEE_LIBM 
>>-D_ISOC99_SOURCE -D_SVID_SOURCE -D__IN_RTAI__  -DMODULE 
>>-D"KBUILD_STR(s)=#s" -D"KBUILD_BASENAME=KBUILD_STR(e_acos)"  
>>-D"KBUILD_MODNAME=KBUILD_STR(rtai_math)" -c -o 
>>/tmp/Rtai/magma/base/math/e_acos.o /tmp/Rtai/magma/base/math/e_acos.c
>>
>>>/tmp/Rtai/magma/base/math/e_acos.c: In function ‘__ieee754_acos’:
>>>/tmp/Rtai/magma/base/math/e_acos.c:70: error: SSE register 
>>
>>return with 
>>
>>>SSE
>>>disabled
>>>make[5]: *** [/tmp/Rtai/magma/base/math/e_acos.o] Error 1
>>>
>>>The problem here is the FPU instructions need the SSE 
>>
>>register which 
>>
>>>has been
>>>explicitly disabled.. Adding -msse to the EXTRA_CFLAGS in 
>>>math/Makefile.kbuild eliminates the error, but I would 
>>
>>surmise that the sse 
>>
>>>register needs to be saved & restored on a context switch. 
>>
>>Addng the -msse 
>>
>>>flag allows rta0_math.ko to compile with one notable warning:
>>>
>>>In file included from /tmp/Rtai/magma/base/math/libm.c:24:
>>>/tmp/Rtai/magma/base/include/rtai_math.h:448: warning: conflicting 
>>>types for
>>>built-in function ‘cabs’
>>>
>>
>>The math lib is meant for small machine and in kernel space. 
>>So it has 
>>no game to play on x86_64. The way to have no problem with it 
>>would have 
>>been to disable it in config. I'll avoid problems to gcc 4 users by 
>>disabling it on such an arch.
>>
>>
>>>Another area for concern is a multitude of warnings throughout the 
>>>build:
>>>
>>>/tmp/Rtai/magma/base/include/asm/rtai_hal.h:487: warning: type 
>>>qualifiers
>>>ignored on function return type
>>>/tmp/Rtai/magma/base/include/asm/rtai_hal.h:493: warning: 
>>
>>type qualifiers 
>>
>>>ignored on function return type
>>>
>>>Removal of the volatile qualifier stops this warning...
>>>
>>
>>Clearly gcc < 4 do the same without a warning, so the qualifier is 
>>useless. It has been removed in magma, thanks.
>>
>>Paolo
>>
>>
>>>Regards, Paul.
>>>
>>
>>
>>
>>
>>------------------------------------------------------------------------
>>
>>[root at sc2hawaii bin]# rtai-info
>>If some fields are empty or look unusual you may have an old version.
>>Compare to the current minimal requirements in Documentation/Changes.
>>
>>Linux sc2hawaii 2.6.19.7-bphys #1 SMP Wed Mar 14 16:56:37 GMT 2007 x86_64 x86_64 x86_64 GNU/Linux
>>
>>Gnu C                  4.1.1
>>Gnu make               3.81
>>util-linux             pre7)
>>mount                  pre7)
>>module-init-tools      3.3-pre1
>>e2fsprogs              1.39
>>jfsutils               1.1.10
>>xfsprogs               2.8.11
>>PPP                    2.4.4
>>isdn4k-utils           3.9
>>Linux C Library        > libc.2.5
>>Dynamic linker (ldd)   2.5
>>Procps                 3.2.7
>>Net-tools              1.60
>>Kbd                    1.12
>>Sh-utils               5.97
>>Modules Loaded         autofs4 hidp nfs lockd nfs_acl rfcomm l2cap bluetooth sunrpc dm_multipath video sbs i2c_ec button battery asus_acpi ac ipv6 parport_pc lp parport sg e1000 floppy ide_cd i2c_i801 cdrom serio_raw i2c_core pcspkr shpchp dm_snapshot dm_zero dm_mirror dm_mod ata_piix libata sd_mod scsi_mod ext3 jbd ehci_hcd ohci_hcd uhci_hcd
>>
>>
>>------------------------------------------------------------------------
>>
>>Script started on Thu 15 Mar 2007 02:15:29 PM GMT
>>]0;root at sc2hawaii:/usr/src/rtai_build[root at sc2hawaii rtai_build]# make
>>make  all-recursive
>>make[1]: Entering directory `/usr/src/rtai-magma_build'
>>Making all in base
>>make[2]: Entering directory `/usr/src/rtai-magma_build/base'
>>Making all in include
>>make[3]: Entering directory `/usr/src/rtai-magma_build/base/include'
>>Making all in asm-x86_64
>>make[4]: Entering directory `/usr/src/rtai-magma_build/base/include/asm-x86_64'
>>make[4]: Nothing to be done for `all'.
>>make[4]: Leaving directory `/usr/src/rtai-magma_build/base/include/asm-x86_64'
>>make[4]: Entering directory `/usr/src/rtai-magma_build/base/include'
>>make[4]: Nothing to be done for `all-am'.
>>make[4]: Leaving directory `/usr/src/rtai-magma_build/base/include'
>>make[3]: Leaving directory `/usr/src/rtai-magma_build/base/include'
>>Making all in ipc
>>make[3]: Entering directory `/usr/src/rtai-magma_build/base/ipc'
>>Making all in bits
>>make[4]: Entering directory `/usr/src/rtai-magma_build/base/ipc/bits'
>>make[5]: Entering directory `/usr/src/linux-2.6.19.7'
>>
>>  WARNING: Symbol version dump /usr/src/linux-2.6.19.7/Module.symvers
>>           is missing; modules will have no dependencies and modversions.
>>
>>  CC [M]  /usr/src/rtai_build/base/ipc/bits/bits.o
>>In file included from /usr/src/rtai_build/base/ipc/bits/../../include/asm/rtai.h:20,
>>                 from /usr/src/rtai_src/base/include/rtai.h:25,
>>                 from /usr/src/rtai_src/base/include/rtai_sched.h:22,
>>                 from /usr/src/rtai_src/base/include/rtai_lxrt.h:69,
>>                 from /usr/src/rtai_src/base/include/rtai_schedcore.h:24,
>>                 from /usr/src/rtai_build/base/ipc/bits/bits.c:25:
>>/usr/src/rtai_build/base/ipc/bits/../../include/asm/rtai_hal.h:487: warning: type qualifiers ignored on function return type
>>/usr/src/rtai_build/base/ipc/bits/../../include/asm/rtai_hal.h:493: warning: type qualifiers ignored on function return type
>>  LD [M]  /usr/src/rtai_build/base/ipc/bits/rtai_bits.o
>>  Building modules, stage 2.
>>  MODPOST 1 modules
>>  CC      /usr/src/rtai_build/base/ipc/bits/rtai_bits.mod.o
>>  LD [M]  /usr/src/rtai_build/base/ipc/bits/rtai_bits.ko
>>make[5]: Leaving directory `/usr/src/linux-2.6.19.7'
>>make[4]: Leaving directory `/usr/src/rtai-magma_build/base/ipc/bits'
>>Making all in fifos
>>make[4]: Entering directory `/usr/src/rtai-magma_build/base/ipc/fifos'
>>make[5]: Entering directory `/usr/src/linux-2.6.19.7'
>>
>>  WARNING: Symbol version dump /usr/src/linux-2.6.19.7/Module.symvers
>>           is missing; modules will have no dependencies and modversions.
>>
>>  CC [M]  /usr/src/rtai_build/base/ipc/fifos/fifos.o
>>In file included from /usr/src/rtai_build/base/ipc/fifos/../../include/asm/rtai.h:20,
>>                 from /usr/src/rtai_src/base/include/rtai.h:25,
>>                 from /usr/src/rtai_src/base/include/rtai_fifos.h:96,
>>                 from /usr/src/rtai_build/base/ipc/fifos/fifos.c:157:
>>/usr/src/rtai_build/base/ipc/fifos/../../include/asm/rtai_hal.h:487: warning: type qualifiers ignored on function return type
>>/usr/src/rtai_build/base/ipc/fifos/../../include/asm/rtai_hal.h:493: warning: type qualifiers ignored on function return type
>>  LD [M]  /usr/src/rtai_build/base/ipc/fifos/rtai_fifos.o
>>  Building modules, stage 2.
>>  MODPOST 1 modules
>>  CC      /usr/src/rtai_build/base/ipc/fifos/rtai_fifos.mod.o
>>  LD [M]  /usr/src/rtai_build/base/ipc/fifos/rtai_fifos.ko
>>make[5]: Leaving directory `/usr/src/linux-2.6.19.7'
>>make[4]: Leaving directory `/usr/src/rtai-magma_build/base/ipc/fifos'
>>Making all in netrpc
>>make[4]: Entering directory `/usr/src/rtai-magma_build/base/ipc/netrpc'
>>make[5]: Entering directory `/usr/src/linux-2.6.19.7'
>>
>>  WARNING: Symbol version dump /usr/src/linux-2.6.19.7/Module.symvers
>>           is missing; modules will have no dependencies and modversions.
>>
>>  CC [M]  /usr/src/rtai_build/base/ipc/netrpc/netrpc.o
>>In file included from /usr/src/rtai_build/base/ipc/netrpc/../../include/asm/rtai.h:20,
>>                 from /usr/src/rtai_src/base/include/rtai.h:25,
>>                 from /usr/src/rtai_src/base/include/rtai_sched.h:22,
>>                 from /usr/src/rtai_src/base/include/rtai_lxrt.h:69,
>>                 from /usr/src/rtai_src/base/include/rtai_schedcore.h:24,
>>                 from /usr/src/rtai_build/base/ipc/netrpc/netrpc.c:29:
>>/usr/src/rtai_build/base/ipc/netrpc/../../include/asm/rtai_hal.h:487: warning: type qualifiers ignored on function return type
>>/usr/src/rtai_build/base/ipc/netrpc/../../include/asm/rtai_hal.h:493: warning: type qualifiers ignored on function return type
>>  LD [M]  /usr/src/rtai_build/base/ipc/netrpc/rtai_netrpc.o
>>  Building modules, stage 2.
>>  MODPOST 1 modules
>>  CC      /usr/src/rtai_build/base/ipc/netrpc/rtai_netrpc.mod.o
>>  LD [M]  /usr/src/rtai_build/base/ipc/netrpc/rtai_netrpc.ko
>>make[5]: Leaving directory `/usr/src/linux-2.6.19.7'
>>make[4]: Leaving directory `/usr/src/rtai-magma_build/base/ipc/netrpc'
>>Making all in shm
>>make[4]: Entering directory `/usr/src/rtai-magma_build/base/ipc/shm'
>>make[5]: Entering directory `/usr/src/linux-2.6.19.7'
>>
>>  WARNING: Symbol version dump /usr/src/linux-2.6.19.7/Module.symvers
>>           is missing; modules will have no dependencies and modversions.
>>
>>  CC [M]  /usr/src/rtai_build/base/ipc/shm/kvmem.o
>>In file included from /usr/src/rtai_build/base/ipc/shm/../../include/asm/rtai.h:20,
>>                 from /usr/src/rtai_src/base/include/rtai.h:25,
>>                 from /usr/src/rtai_src/base/include/rtai_shm.h:111,
>>                 from /usr/src/rtai_build/base/ipc/shm/kvmem.c:19:
>>/usr/src/rtai_build/base/ipc/shm/../../include/asm/rtai_hal.h:487: warning: type qualifiers ignored on function return type
>>/usr/src/rtai_build/base/ipc/shm/../../include/asm/rtai_hal.h:493: warning: type qualifiers ignored on function return type
>>  CC [M]  /usr/src/rtai_build/base/ipc/shm/shm.o
>>In file included from /usr/src/rtai_build/base/ipc/shm/../../include/asm/rtai.h:20,
>>                 from /usr/src/rtai_src/base/include/rtai.h:25,
>>                 from /usr/src/rtai_src/base/include/rtai_sched.h:22,
>>                 from /usr/src/rtai_src/base/include/rtai_lxrt.h:69,
>>                 from /usr/src/rtai_src/base/include/rtai_schedcore.h:24,
>>                 from /usr/src/rtai_build/base/ipc/shm/shm.c:41:
>>/usr/src/rtai_build/base/ipc/shm/../../include/asm/rtai_hal.h:487: warning: type qualifiers ignored on function return type
>>/usr/src/rtai_build/base/ipc/shm/../../include/asm/rtai_hal.h:493: warning: type qualifiers ignored on function return type
>>  LD [M]  /usr/src/rtai_build/base/ipc/shm/rtai_shm.o
>>  Building modules, stage 2.
>>  MODPOST 1 modules
>>  CC      /usr/src/rtai_build/base/ipc/shm/rtai_shm.mod.o
>>  LD [M]  /usr/src/rtai_build/base/ipc/shm/rtai_shm.ko
>>make[5]: Leaving directory `/usr/src/linux-2.6.19.7'
>>make[4]: Leaving directory `/usr/src/rtai-magma_build/base/ipc/shm'
>>Making all in sem
>>make[4]: Entering directory `/usr/src/rtai-magma_build/base/ipc/sem'
>>make[5]: Entering directory `/usr/src/linux-2.6.19.7'
>>
>>  WARNING: Symbol version dump /usr/src/linux-2.6.19.7/Module.symvers
>>           is missing; modules will have no dependencies and modversions.
>>
>>  CC [M]  /usr/src/rtai_build/base/ipc/sem/sem.o
>>In file included from /usr/src/rtai_build/base/ipc/sem/../../include/asm/rtai.h:20,
>>                 from /usr/src/rtai_src/base/include/rtai.h:25,
>>                 from /usr/src/rtai_src/base/include/rtai_sched.h:22,
>>                 from /usr/src/rtai_src/base/include/rtai_lxrt.h:69,
>>                 from /usr/src/rtai_src/base/include/rtai_schedcore.h:24,
>>                 from /usr/src/rtai_build/base/ipc/sem/sem.c:37:
>>/usr/src/rtai_build/base/ipc/sem/../../include/asm/rtai_hal.h:487: warning: type qualifiers ignored on function return type
>>/usr/src/rtai_build/base/ipc/sem/../../include/asm/rtai_hal.h:493: warning: type qualifiers ignored on function return type
>>  LD [M]  /usr/src/rtai_build/base/ipc/sem/rtai_sem.o
>>  Building modules, stage 2.
>>  MODPOST 1 modules
>>  CC      /usr/src/rtai_build/base/ipc/sem/rtai_sem.mod.o
>>  LD [M]  /usr/src/rtai_build/base/ipc/sem/rtai_sem.ko
>>make[5]: Leaving directory `/usr/src/linux-2.6.19.7'
>>make[4]: Leaving directory `/usr/src/rtai-magma_build/base/ipc/sem'
>>Making all in msg
>>make[4]: Entering directory `/usr/src/rtai-magma_build/base/ipc/msg'
>>make[5]: Entering directory `/usr/src/linux-2.6.19.7'
>>
>>  WARNING: Symbol version dump /usr/src/linux-2.6.19.7/Module.symvers
>>           is missing; modules will have no dependencies and modversions.
>>
>>  CC [M]  /usr/src/rtai_build/base/ipc/msg/msg.o
>>In file included from /usr/src/rtai_build/base/ipc/msg/../../include/asm/rtai.h:20,
>>                 from /usr/src/rtai_src/base/include/rtai.h:25,
>>                 from /usr/src/rtai_src/base/include/rtai_sched.h:22,
>>                 from /usr/src/rtai_src/base/include/rtai_lxrt.h:69,
>>                 from /usr/src/rtai_src/base/include/rtai_schedcore.h:24,
>>                 from /usr/src/rtai_build/base/ipc/msg/msg.c:43:
>>/usr/src/rtai_build/base/ipc/msg/../../include/asm/rtai_hal.h:487: warning: type qualifiers ignored on function return type
>>/usr/src/rtai_build/base/ipc/msg/../../include/asm/rtai_hal.h:493: warning: type qualifiers ignored on function return type
>>  LD [M]  /usr/src/rtai_build/base/ipc/msg/rtai_msg.o
>>  Building modules, stage 2.
>>  MODPOST 1 modules
>>  CC      /usr/src/rtai_build/base/ipc/msg/rtai_msg.mod.o
>>  LD [M]  /usr/src/rtai_build/base/ipc/msg/rtai_msg.ko
>>make[5]: Leaving directory `/usr/src/linux-2.6.19.7'
>>make[4]: Leaving directory `/usr/src/rtai-magma_build/base/ipc/msg'
>>Making all in mbx
>>make[4]: Entering directory `/usr/src/rtai-magma_build/base/ipc/mbx'
>>make[5]: Entering directory `/usr/src/linux-2.6.19.7'
>>
>>  WARNING: Symbol version dump /usr/src/linux-2.6.19.7/Module.symvers
>>           is missing; modules will have no dependencies and modversions.
>>
>>  CC [M]  /usr/src/rtai_build/base/ipc/mbx/mbx.o
>>In file included from /usr/src/rtai_build/base/ipc/mbx/../../include/asm/rtai.h:20,
>>                 from /usr/src/rtai_src/base/include/rtai.h:25,
>>                 from /usr/src/rtai_src/base/include/rtai_sched.h:22,
>>                 from /usr/src/rtai_src/base/include/rtai_lxrt.h:69,
>>                 from /usr/src/rtai_src/base/include/rtai_schedcore.h:24,
>>                 from /usr/src/rtai_build/base/ipc/mbx/mbx.c:36:
>>/usr/src/rtai_build/base/ipc/mbx/../../include/asm/rtai_hal.h:487: warning: type qualifiers ignored on function return type
>>/usr/src/rtai_build/base/ipc/mbx/../../include/asm/rtai_hal.h:493: warning: type qualifiers ignored on function return type
>>  LD [M]  /usr/src/rtai_build/base/ipc/mbx/rtai_mbx.o
>>  Building modules, stage 2.
>>  MODPOST 1 modules
>>  CC      /usr/src/rtai_build/base/ipc/mbx/rtai_mbx.mod.o
>>  LD [M]  /usr/src/rtai_build/base/ipc/mbx/rtai_mbx.ko
>>make[5]: Leaving directory `/usr/src/linux-2.6.19.7'
>>make[4]: Leaving directory `/usr/src/rtai-magma_build/base/ipc/mbx'
>>Making all in tbx
>>make[4]: Entering directory `/usr/src/rtai-magma_build/base/ipc/tbx'
>>make[5]: Entering directory `/usr/src/linux-2.6.19.7'
>>
>>  WARNING: Symbol version dump /usr/src/linux-2.6.19.7/Module.symvers
>>           is missing; modules will have no dependencies and modversions.
>>
>>  CC [M]  /usr/src/rtai_build/base/ipc/tbx/tbx.o
>>In file included from /usr/src/rtai_build/base/ipc/tbx/../../include/asm/rtai.h:20,
>>                 from /usr/src/rtai_src/base/include/rtai.h:25,
>>                 from /usr/src/rtai_src/base/include/rtai_registry.h:58,
>>                 from /usr/src/rtai_build/base/ipc/tbx/tbx.c:26:
>>/usr/src/rtai_build/base/ipc/tbx/../../include/asm/rtai_hal.h:487: warning: type qualifiers ignored on function return type
>>/usr/src/rtai_build/base/ipc/tbx/../../include/asm/rtai_hal.h:493: warning: type qualifiers ignored on function return type
>>  LD [M]  /usr/src/rtai_build/base/ipc/tbx/rtai_tbx.o
>>  Building modules, stage 2.
>>  MODPOST 1 modules
>>  CC      /usr/src/rtai_build/base/ipc/tbx/rtai_tbx.mod.o
>>  LD [M]  /usr/src/rtai_build/base/ipc/tbx/rtai_tbx.ko
>>make[5]: Leaving directory `/usr/src/linux-2.6.19.7'
>>make[4]: Leaving directory `/usr/src/rtai-magma_build/base/ipc/tbx'
>>Making all in mq
>>make[4]: Entering directory `/usr/src/rtai-magma_build/base/ipc/mq'
>>make[5]: Entering directory `/usr/src/linux-2.6.19.7'
>>
>>  WARNING: Symbol version dump /usr/src/linux-2.6.19.7/Module.symvers
>>           is missing; modules will have no dependencies and modversions.
>>
>>  CC [M]  /usr/src/rtai_build/base/ipc/mq/mq.o
>>In file included from /usr/src/rtai_build/base/ipc/mq/../../include/asm/rtai.h:20,
>>                 from /usr/src/rtai_src/base/include/rtai.h:25,
>>                 from /usr/src/rtai_src/base/include/rtai_sched.h:22,
>>                 from /usr/src/rtai_src/base/include/rtai_lxrt.h:69,
>>                 from /usr/src/rtai_src/base/include/rtai_schedcore.h:24,
>>                 from /usr/src/rtai_build/base/ipc/mq/mq.c:40:
>>/usr/src/rtai_build/base/ipc/mq/../../include/asm/rtai_hal.h:487: warning: type qualifiers ignored on function return type
>>/usr/src/rtai_build/base/ipc/mq/../../include/asm/rtai_hal.h:493: warning: type qualifiers ignored on function return type
>>  LD [M]  /usr/src/rtai_build/base/ipc/mq/rtai_mq.o
>>  Building modules, stage 2.
>>  MODPOST 1 modules
>>  CC      /usr/src/rtai_build/base/ipc/mq/rtai_mq.mod.o
>>  LD [M]  /usr/src/rtai_build/base/ipc/mq/rtai_mq.ko
>>make[5]: Leaving directory `/usr/src/linux-2.6.19.7'
>>make[4]: Leaving directory `/usr/src/rtai-magma_build/base/ipc/mq'
>>make[4]: Entering directory `/usr/src/rtai-magma_build/base/ipc'
>>make[4]: Nothing to be done for `all-am'.
>>make[4]: Leaving directory `/usr/src/rtai-magma_build/base/ipc'
>>make[3]: Leaving directory `/usr/src/rtai-magma_build/base/ipc'
>>Making all in malloc
>>make[3]: Entering directory `/usr/src/rtai-magma_build/base/malloc'
>>make[3]: Nothing to be done for `all'.
>>make[3]: Leaving directory `/usr/src/rtai-magma_build/base/malloc'
>>Making all in tasklets
>>make[3]: Entering directory `/usr/src/rtai-magma_build/base/tasklets'
>>make[4]: Entering directory `/usr/src/linux-2.6.19.7'
>>
>>  WARNING: Symbol version dump /usr/src/linux-2.6.19.7/Module.symvers
>>           is missing; modules will have no dependencies and modversions.
>>
>>  CC [M]  /usr/src/rtai_build/base/tasklets/tasklets.o
>>In file included from /usr/src/rtai_build/base/tasklets/../include/asm/rtai.h:20,
>>                 from /usr/src/rtai_src/base/include/rtai.h:25,
>>                 from /usr/src/rtai_src/base/include/rtai_sched.h:22,
>>                 from /usr/src/rtai_src/base/include/rtai_tasklets.h:34,
>>                 from /usr/src/rtai_build/base/tasklets/tasklets.c:86:
>>/usr/src/rtai_build/base/tasklets/../include/asm/rtai_hal.h:487: warning: type qualifiers ignored on function return type
>>/usr/src/rtai_build/base/tasklets/../include/asm/rtai_hal.h:493: warning: type qualifiers ignored on function return type
>>/usr/src/rtai_build/base/tasklets/tasklets.c:101: warning: ‘linux_cr0’ defined but not used
>>  LD [M]  /usr/src/rtai_build/base/tasklets/rtai_tasklets.o
>>  Building modules, stage 2.
>>  MODPOST 1 modules
>>  CC      /usr/src/rtai_build/base/tasklets/rtai_tasklets.mod.o
>>  LD [M]  /usr/src/rtai_build/base/tasklets/rtai_tasklets.ko
>>make[4]: Leaving directory `/usr/src/linux-2.6.19.7'
>>make[4]: Entering directory `/usr/src/linux-2.6.19.7'
>>
>>  WARNING: Symbol version dump /usr/src/linux-2.6.19.7/Module.symvers
>>           is missing; modules will have no dependencies and modversions.
>>
>>  CC [M]  /usr/src/rtai_build/base/tasklets/signal.o
>>In file included from /usr/src/rtai_build/base/tasklets/../include/asm/rtai.h:20,
>>                 from /usr/src/rtai_src/base/include/rtai.h:25,
>>                 from /usr/src/rtai_src/base/include/rtai_sched.h:22,
>>                 from /usr/src/rtai_src/base/include/rtai_lxrt.h:69,
>>                 from /usr/src/rtai_src/base/include/rtai_schedcore.h:24,
>>                 from /usr/src/rtai_build/base/tasklets/signal.c:23:
>>/usr/src/rtai_build/base/tasklets/../include/asm/rtai_hal.h:487: warning: type qualifiers ignored on function return type
>>/usr/src/rtai_build/base/tasklets/../include/asm/rtai_hal.h:493: warning: type qualifiers ignored on function return type
>>  LD [M]  /usr/src/rtai_build/base/tasklets/rtai_signal.o
>>  Building modules, stage 2.
>>  MODPOST 1 modules
>>  CC      /usr/src/rtai_build/base/tasklets/rtai_signal.mod.o
>>  LD [M]  /usr/src/rtai_build/base/tasklets/rtai_signal.ko
>>make[4]: Leaving directory `/usr/src/linux-2.6.19.7'
>>make[3]: Leaving directory `/usr/src/rtai-magma_build/base/tasklets'
>>Making all in usi
>>make[3]: Entering directory `/usr/src/rtai-magma_build/base/usi'
>>make[4]: Entering directory `/usr/src/linux-2.6.19.7'
>>
>>  WARNING: Symbol version dump /usr/src/linux-2.6.19.7/Module.symvers
>>           is missing; modules will have no dependencies and modversions.
>>
>>  CC [M]  /usr/src/rtai_build/base/usi/usi.o
>>  LD [M]  /usr/src/rtai_build/base/usi/rtai_usi.o
>>  Building modules, stage 2.
>>  MODPOST 1 modules
>>  CC      /usr/src/rtai_build/base/usi/rtai_usi.mod.o
>>  LD [M]  /usr/src/rtai_build/base/usi/rtai_usi.ko
>>make[4]: Leaving directory `/usr/src/linux-2.6.19.7'
>>make[3]: Leaving directory `/usr/src/rtai-magma_build/base/usi'
>>Making all in wd
>>make[3]: Entering directory `/usr/src/rtai-magma_build/base/wd'
>>make[4]: Entering directory `/usr/src/linux-2.6.19.7'
>>
>>  WARNING: Symbol version dump /usr/src/linux-2.6.19.7/Module.symvers
>>           is missing; modules will have no dependencies and modversions.
>>
>>  CC [M]  /usr/src/rtai_build/base/wd/wd.o
>>In file included from /usr/src/rtai_build/base/wd/../include/asm/rtai.h:20,
>>                 from /usr/src/rtai_build/base/wd/wd.c:110:
>>/usr/src/rtai_build/base/wd/../include/asm/rtai_hal.h:487: warning: type qualifiers ignored on function return type
>>/usr/src/rtai_build/base/wd/../include/asm/rtai_hal.h:493: warning: type qualifiers ignored on function return type
>>  LD [M]  /usr/src/rtai_build/base/wd/rtai_wd.o
>>  Building modules, stage 2.
>>  MODPOST 1 modules
>>  CC      /usr/src/rtai_build/base/wd/rtai_wd.mod.o
>>  LD [M]  /usr/src/rtai_build/base/wd/rtai_wd.ko
>>make[4]: Leaving directory `/usr/src/linux-2.6.19.7'
>>make[3]: Leaving directory `/usr/src/rtai-magma_build/base/wd'
>>Making all in sched
>>make[3]: Entering directory `/usr/src/rtai-magma_build/base/sched'
>>Making all in liblxrt
>>make[4]: Entering directory `/usr/src/rtai-magma_build/base/sched/liblxrt'
>>if /bin/sh ../../../libtool --tag=CC --mode=compile gcc -DHAVE_CONFIG_H -I. -I/usr/src/rtai_src/base/sched/liblxrt -I../../.. -O2 -I/usr/src/linux/include  -Wall -Wstrict-prototypes -pipe -D__IN_RTAI__ -D_GNU_SOURCE -fno-inline -I/usr/src/rtai_src/base/include -I../../include -I/usr/src/rtai_src/addons/drivers/serial     -MT init.lo -MD -MP -MF ".deps/init.Tpo" -c -o init.lo /usr/src/rtai_src/base/sched/liblxrt/init.c; \
>>	then mv -f ".deps/init.Tpo" ".deps/init.Plo"; else rm -f ".deps/init.Tpo"; exit 1; fi
>>mkdir .libs
>> gcc -DHAVE_CONFIG_H -I. -I/usr/src/rtai_src/base/sched/liblxrt -I../../.. -O2 -I/usr/src/linux/include -Wall -Wstrict-prototypes -pipe -D__IN_RTAI__ -D_GNU_SOURCE -fno-inline -I/usr/src/rtai_src/base/include -I../../include -I/usr/src/rtai_src/addons/drivers/serial -MT init.lo -MD -MP -MF .deps/init.Tpo -c /usr/src/rtai_src/base/sched/liblxrt/init.c  -fPIC -DPIC -o .libs/init.o
>> gcc -DHAVE_CONFIG_H -I. -I/usr/src/rtai_src/base/sched/liblxrt -I../../.. -O2 -I/usr/src/linux/include -Wall -Wstrict-prototypes -pipe -D__IN_RTAI__ -D_GNU_SOURCE -fno-inline -I/usr/src/rtai_src/base/include -I../../include -I/usr/src/rtai_src/addons/drivers/serial -MT init.lo -MD -MP -MF .deps/init.Tpo -c /usr/src/rtai_src/base/sched/liblxrt/init.c -o init.o >/dev/null 2>&1
>>if /bin/sh ../../../libtool --tag=CC --mode=compile gcc -DHAVE_CONFIG_H -I. -I/usr/src/rtai_src/base/sched/liblxrt -I../../.. -O2 -I/usr/src/linux/include  -Wall -Wstrict-prototypes -pipe -D__IN_RTAI__ -D_GNU_SOURCE -fno-inline -I/usr/src/rtai_src/base/include -I../../include -I/usr/src/rtai_src/addons/drivers/serial     -MT services.lo -MD -MP -MF ".deps/services.Tpo" -c -o services.lo /usr/src/rtai_src/base/sched/liblxrt/services.c; \
>>	then mv -f ".deps/services.Tpo" ".deps/services.Plo"; else rm -f ".deps/services.Tpo"; exit 1; fi
>> gcc -DHAVE_CONFIG_H -I. -I/usr/src/rtai_src/base/sched/liblxrt -I../../.. -O2 -I/usr/src/linux/include -Wall -Wstrict-prototypes -pipe -D__IN_RTAI__ -D_GNU_SOURCE -fno-inline -I/usr/src/rtai_src/base/include -I../../include -I/usr/src/rtai_src/addons/drivers/serial -MT services.lo -MD -MP -MF .deps/services.Tpo -c /usr/src/rtai_src/base/sched/liblxrt/services.c  -fPIC -DPIC -o .libs/services.o
>> gcc -DHAVE_CONFIG_H -I. -I/usr/src/rtai_src/base/sched/liblxrt -I../../.. -O2 -I/usr/src/linux/include -Wall -Wstrict-prototypes -pipe -D__IN_RTAI__ -D_GNU_SOURCE -fno-inline -I/usr/src/rtai_src/base/include -I../../include -I/usr/src/rtai_src/addons/drivers/serial -MT services.lo -MD -MP -MF .deps/services.Tpo -c /usr/src/rtai_src/base/sched/liblxrt/services.c -o services.o >/dev/null 2>&1
>>if /bin/sh ../../../libtool --tag=CC --mode=compile gcc -DHAVE_CONFIG_H -I. -I/usr/src/rtai_src/base/sched/liblxrt -I../../.. -O2 -I/usr/src/linux/include  -Wall -Wstrict-prototypes -pipe -D__IN_RTAI__ -D_GNU_SOURCE -fno-inline -I/usr/src/rtai_src/base/include -I../../include -I/usr/src/rtai_src/addons/drivers/serial     -MT touchall.lo -MD -MP -MF ".deps/touchall.Tpo" -c -o touchall.lo /usr/src/rtai_src/base/sched/liblxrt/touchall.c; \
>>	then mv -f ".deps/touchall.Tpo" ".deps/touchall.Plo"; else rm -f ".deps/touchall.Tpo"; exit 1; fi
>> gcc -DHAVE_CONFIG_H -I. -I/usr/src/rtai_src/base/sched/liblxrt -I../../.. -O2 -I/usr/src/linux/include -Wall -Wstrict-prototypes -pipe -D__IN_RTAI__ -D_GNU_SOURCE -fno-inline -I/usr/src/rtai_src/base/include -I../../include -I/usr/src/rtai_src/addons/drivers/serial -MT touchall.lo -MD -MP -MF .deps/touchall.Tpo -c /usr/src/rtai_src/base/sched/liblxrt/touchall.c  -fPIC -DPIC -o .libs/touchall.o
>> gcc -DHAVE_CONFIG_H -I. -I/usr/src/rtai_src/base/sched/liblxrt -I../../.. -O2 -I/usr/src/linux/include -Wall -Wstrict-prototypes -pipe -D__IN_RTAI__ -D_GNU_SOURCE -fno-inline -I/usr/src/rtai_src/base/include -I../../include -I/usr/src/rtai_src/addons/drivers/serial -MT touchall.lo -MD -MP -MF .deps/touchall.Tpo -c /usr/src/rtai_src/base/sched/liblxrt/touchall.c -o touchall.o >/dev/null 2>&1
>>/bin/sh ../../../libtool --tag=CC --mode=link gcc     -o liblxrt.la -rpath /usr/src/rtai_install/lib -module -version-info 1:0:0 init.lo services.lo touchall.lo  
>>gcc -shared  .libs/init.o .libs/services.o .libs/touchall.o   -Wl,-soname -Wl,liblxrt.so.1 -o .libs/liblxrt.so.1.0.0
>>(cd .libs && rm -f liblxrt.so.1 && ln -s liblxrt.so.1.0.0 liblxrt.so.1)
>>(cd .libs && rm -f liblxrt.so && ln -s liblxrt.so.1.0.0 liblxrt.so)
>>ar cru .libs/liblxrt.a  init.o services.o touchall.o
>>ranlib .libs/liblxrt.a
>>creating liblxrt.la
>>(cd .libs && rm -f liblxrt.la && ln -s ../liblxrt.la liblxrt.la)
>>make[4]: Leaving directory `/usr/src/rtai-magma_build/base/sched/liblxrt'
>>make[4]: Entering directory `/usr/src/rtai-magma_build/base/sched'
>>make[5]: Entering directory `/usr/src/linux-2.6.19.7'
>>
>>  WARNING: Symbol version dump /usr/src/linux-2.6.19.7/Module.symvers
>>           is missing; modules will have no dependencies and modversions.
>>
>>  CC [M]  /usr/src/rtai_build/base/sched/sched.o
>>In file included from /usr/src/rtai_build/base/sched/../include/asm/rtai.h:20,
>>                 from /usr/src/rtai_src/base/include/rtai.h:25,
>>                 from /usr/src/rtai_build/base/sched/sched.c:70:
>>/usr/src/rtai_build/base/sched/../include/asm/rtai_hal.h:487: warning: type qualifiers ignored on function return type
>>/usr/src/rtai_build/base/sched/../include/asm/rtai_hal.h:493: warning: type qualifiers ignored on function return type
>>  CC [M]  /usr/src/rtai_build/base/sched/sys.o
>>In file included from /usr/src/rtai_build/base/sched/../include/asm/rtai.h:20,
>>                 from /usr/src/rtai_src/base/include/rtai.h:25,
>>                 from /usr/src/rtai_src/base/include/rtai_sched.h:22,
>>                 from /usr/src/rtai_build/base/sched/sys.c:35:
>>/usr/src/rtai_build/base/sched/../include/asm/rtai_hal.h:487: warning: type qualifiers ignored on function return type
>>/usr/src/rtai_build/base/sched/../include/asm/rtai_hal.h:493: warning: type qualifiers ignored on function return type
>>  CC [M]  /usr/src/rtai_build/base/sched/api.o
>>In file included from /usr/src/rtai_build/base/sched/../include/asm/rtai.h:20,
>>                 from /usr/src/rtai_src/base/include/rtai.h:25,
>>                 from /usr/src/rtai_src/base/include/rtai_sched.h:22,
>>                 from /usr/src/rtai_src/base/include/rtai_lxrt.h:69,
>>                 from /usr/src/rtai_src/base/include/rtai_schedcore.h:24,
>>                 from /usr/src/rtai_build/base/sched/api.c:29:
>>/usr/src/rtai_build/base/sched/../include/asm/rtai_hal.h:487: warning: type qualifiers ignored on function return type
>>/usr/src/rtai_build/base/sched/../include/asm/rtai_hal.h:493: warning: type qualifiers ignored on function return type
>>  CC [M]  /usr/src/rtai_build/base/sched/malloc.o
>>In file included from /usr/src/rtai_build/base/sched/../include/asm/rtai.h:20,
>>                 from /usr/src/rtai_build/base/sched/malloc.c:40:
>>/usr/src/rtai_build/base/sched/../include/asm/rtai_hal.h:487: warning: type qualifiers ignored on function return type
>>/usr/src/rtai_build/base/sched/../include/asm/rtai_hal.h:493: warning: type qualifiers ignored on function return type
>>  LD [M]  /usr/src/rtai_build/base/sched/rtai_lxrt.o
>>  Building modules, stage 2.
>>  MODPOST 1 modules
>>  CC      /usr/src/rtai_build/base/sched/rtai_lxrt.mod.o
>>  LD [M]  /usr/src/rtai_build/base/sched/rtai_lxrt.ko
>>make[5]: Leaving directory `/usr/src/linux-2.6.19.7'
>>make[4]: Leaving directory `/usr/src/rtai-magma_build/base/sched'
>>make[3]: Leaving directory `/usr/src/rtai-magma_build/base/sched'
>>Making all in arch
>>make[3]: Entering directory `/usr/src/rtai-magma_build/base/arch'
>>Making all in x86_64
>>make[4]: Entering directory `/usr/src/rtai-magma_build/base/arch/x86_64'
>>Making all in hal
>>make[5]: Entering directory `/usr/src/rtai-magma_build/base/arch/x86_64/hal'
>>make[6]: Entering directory `/usr/src/linux-2.6.19.7'
>>
>>  WARNING: Symbol version dump /usr/src/linux-2.6.19.7/Module.symvers
>>           is missing; modules will have no dependencies and modversions.
>>
>>  CC [M]  /usr/src/rtai_build/base/arch/x86_64/hal/hal.o
>>In file included from /usr/src/rtai_build/base/arch/x86_64/hal/hal.c:44:
>>/usr/src/rtai_build/base/arch/x86_64/hal/../../../include/asm/rtai_hal.h:487: warning: type qualifiers ignored on function return type
>>/usr/src/rtai_build/base/arch/x86_64/hal/../../../include/asm/rtai_hal.h:493: warning: type qualifiers ignored on function return type
>>  CC [M]  /usr/src/rtai_build/base/arch/x86_64/hal/rtc.o
>>  LD [M]  /usr/src/rtai_build/base/arch/x86_64/hal/rtai_hal.o
>>  Building modules, stage 2.
>>  MODPOST 1 modules
>>  CC      /usr/src/rtai_build/base/arch/x86_64/hal/rtai_hal.mod.o
>>  LD [M]  /usr/src/rtai_build/base/arch/x86_64/hal/rtai_hal.ko
>>make[6]: Leaving directory `/usr/src/linux-2.6.19.7'
>>make[5]: Leaving directory `/usr/src/rtai-magma_build/base/arch/x86_64/hal'
>>Making all in calibration
>>make[5]: Entering directory `/usr/src/rtai-magma_build/base/arch/x86_64/calibration'
>>if gcc -DHAVE_CONFIG_H -I. -I/usr/src/rtai_src/base/arch/x86_64/calibration -I../../../..  -O2 -I/usr/src/linux/include  -Wall -Wstrict-prototypes -pipe -D__IN_RTAI__ -DKERNEL_HELPER_PATH="\"/usr/src/rtai_install/calibration/calibrate_rt.ko\"" -DUSER_HELPER_PATH="\"/usr/src/rtai_install/calibration/calibration_helper\"" -I/usr/src/rtai_src/base/include -I../../../include    -MT calibrate-calibrate.o -MD -MP -MF ".deps/calibrate-calibrate.Tpo" -c -o calibrate-calibrate.o `test -f 'calibrate.c' || echo '/usr/src/rtai_src/base/arch/x86_64/calibration/'`calibrate.c; \
>>	then mv -f ".deps/calibrate-calibrate.Tpo" ".deps/calibrate-calibrate.Po"; else rm -f ".deps/calibrate-calibrate.Tpo"; exit 1; fi
>>/bin/sh ../../../../libtool --tag=CC --mode=link gcc     -o calibrate  calibrate-calibrate.o  
>>mkdir .libs
>>gcc -o calibrate calibrate-calibrate.o 
>>if gcc -DHAVE_CONFIG_H -I. -I/usr/src/rtai_src/base/arch/x86_64/calibration -I../../../..  -O2 -I/usr/src/linux/include  -Wall -Wstrict-prototypes -pipe -D__IN_RTAI__ -I/usr/src/rtai_src/base/include -I../../../include    -MT calibration_helper-calibration_helper.o -MD -MP -MF ".deps/calibration_helper-calibration_helper.Tpo" -c -o calibration_helper-calibration_helper.o `test -f 'calibration_helper.c' || echo '/usr/src/rtai_src/base/arch/x86_64/calibration/'`calibration_helper.c; \
>>	then mv -f ".deps/calibration_helper-calibration_helper.Tpo" ".deps/calibration_helper-calibration_helper.Po"; else rm -f ".deps/calibration_helper-calibration_helper.Tpo"; exit 1; fi
>>/bin/sh ../../../../libtool --tag=CC --mode=link gcc     -o calibration_helper  calibration_helper-calibration_helper.o ../../../sched/liblxrt/liblxrt.la -lpthread 
>>
>>*** Warning: Linking the executable calibration_helper against the loadable module
>>*** liblxrt.so is not portable!
>>gcc -o .libs/calibration_helper calibration_helper-calibration_helper.o  ../../../sched/liblxrt/.libs/liblxrt.so -lpthread -Wl,--rpath -Wl,/usr/src/rtai_install/lib
>>creating calibration_helper
>>make[6]: Entering directory `/usr/src/linux-2.6.19.7'
>>
>>  WARNING: Symbol version dump /usr/src/linux-2.6.19.7/Module.symvers
>>           is missing; modules will have no dependencies and modversions.
>>
>>  CC [M]  /usr/src/rtai_build/base/arch/x86_64/calibration/calibrate-module.o
>>In file included from /usr/src/rtai_build/base/arch/x86_64/calibration/../../../include/asm/rtai.h:20,
>>                 from /usr/src/rtai_src/base/include/rtai.h:25,
>>                 from /usr/src/rtai_src/base/include/rtai_sched.h:22,
>>                 from /usr/src/rtai_build/base/arch/x86_64/calibration/calibrate-module.c:24:
>>/usr/src/rtai_build/base/arch/x86_64/calibration/../../../include/asm/rtai_hal.h:487: warning: type qualifiers ignored on function return type
>>/usr/src/rtai_build/base/arch/x86_64/calibration/../../../include/asm/rtai_hal.h:493: warning: type qualifiers ignored on function return type
>>/usr/src/rtai_build/base/arch/x86_64/calibration/calibrate-module.c: In function ‘user_srq’:
>>/usr/src/rtai_build/base/arch/x86_64/calibration/calibrate-module.c:132: warning: ignoring return value of ‘copy_from_user’, declared with attribute warn_unused_result
>>  LD [M]  /usr/src/rtai_build/base/arch/x86_64/calibration/calibrate_rt.o
>>  Building modules, stage 2.
>>  MODPOST 1 modules
>>  CC      /usr/src/rtai_build/base/arch/x86_64/calibration/calibrate_rt.mod.o
>>  LD [M]  /usr/src/rtai_build/base/arch/x86_64/calibration/calibrate_rt.ko
>>make[6]: Leaving directory `/usr/src/linux-2.6.19.7'
>>make[5]: Leaving directory `/usr/src/rtai-magma_build/base/arch/x86_64/calibration'
>>make[5]: Entering directory `/usr/src/rtai-magma_build/base/arch/x86_64'
>>make[5]: Nothing to be done for `all-am'.
>>make[5]: Leaving directory `/usr/src/rtai-magma_build/base/arch/x86_64'
>>make[4]: Leaving directory `/usr/src/rtai-magma_build/base/arch/x86_64'
>>make[4]: Entering directory `/usr/src/rtai-magma_build/base/arch'
>>make[4]: Nothing to be done for `all-am'.
>>make[4]: Leaving directory `/usr/src/rtai-magma_build/base/arch'
>>make[3]: Leaving directory `/usr/src/rtai-magma_build/base/arch'
>>Making all in scripts
>>make[3]: Entering directory `/usr/src/rtai-magma_build/base/scripts'
>>make[3]: Nothing to be done for `all'.
>>make[3]: Leaving directory `/usr/src/rtai-magma_build/base/scripts'
>>Making all in posix
>>make[3]: Entering directory `/usr/src/rtai-magma_build/base/posix'
>>make[3]: Nothing to be done for `all'.
>>make[3]: Leaving directory `/usr/src/rtai-magma_build/base/posix'
>>make[3]: Entering directory `/usr/src/rtai-magma_build/base'
>>make[3]: Nothing to be done for `all-am'.
>>make[3]: Leaving directory `/usr/src/rtai-magma_build/base'
>>make[2]: Leaving directory `/usr/src/rtai-magma_build/base'
>>Making all in doc
>>make[2]: Entering directory `/usr/src/rtai-magma_build/doc'
>>Making all in docbook
>>make[3]: Entering directory `/usr/src/rtai-magma_build/doc/docbook'
>>Making all in custom-stylesheets
>>make[4]: Entering directory `/usr/src/rtai-magma_build/doc/docbook/custom-stylesheets'
>>Making all in xsl
>>make[5]: Entering directory `/usr/src/rtai-magma_build/doc/docbook/custom-stylesheets/xsl'
>>Making all in common
>>make[6]: Entering directory `/usr/src/rtai-magma_build/doc/docbook/custom-stylesheets/xsl/common'
>>make[6]: Nothing to be done for `all'.
>>make[6]: Leaving directory `/usr/src/rtai-magma_build/doc/docbook/custom-stylesheets/xsl/common'
>>Making all in fo
>>make[6]: Entering directory `/usr/src/rtai-magma_build/doc/docbook/custom-stylesheets/xsl/fo'
>>make[6]: Nothing to be done for `all'.
>>make[6]: Leaving directory `/usr/src/rtai-magma_build/doc/docbook/custom-stylesheets/xsl/fo'
>>Making all in html
>>make[6]: Entering directory `/usr/src/rtai-magma_build/doc/docbook/custom-stylesheets/xsl/html'
>>make[6]: Nothing to be done for `all'.
>>make[6]: Leaving directory `/usr/src/rtai-magma_build/doc/docbook/custom-stylesheets/xsl/html'
>>make[6]: Entering directory `/usr/src/rtai-magma_build/doc/docbook/custom-stylesheets/xsl'
>>make[6]: Nothing to be done for `all-am'.
>>make[6]: Leaving directory `/usr/src/rtai-magma_build/doc/docbook/custom-stylesheets/xsl'
>>make[5]: Leaving directory `/usr/src/rtai-magma_build/doc/docbook/custom-stylesheets/xsl'
>>make[5]: Entering directory `/usr/src/rtai-magma_build/doc/docbook/custom-stylesheets'
>>make[5]: Nothing to be done for `all-am'.
>>make[5]: Leaving directory `/usr/src/rtai-magma_build/doc/docbook/custom-stylesheets'
>>make[4]: Leaving directory `/usr/src/rtai-magma_build/doc/docbook/custom-stylesheets'
>>Making all in docbook-test
>>make[4]: Entering directory `/usr/src/rtai-magma_build/doc/docbook/docbook-test'
>>make[4]: Nothing to be done for `all'.
>>make[4]: Leaving directory `/usr/src/rtai-magma_build/doc/docbook/docbook-test'
>>make[4]: Entering directory `/usr/src/rtai-magma_build/doc/docbook'
>>make[4]: Nothing to be done for `all-am'.
>>make[4]: Leaving directory `/usr/src/rtai-magma_build/doc/docbook'
>>make[3]: Leaving directory `/usr/src/rtai-magma_build/doc/docbook'
>>Making all in doxygen
>>make[3]: Entering directory `/usr/src/rtai-magma_build/doc/doxygen'
>>make[3]: Nothing to be done for `all'.
>>make[3]: Leaving directory `/usr/src/rtai-magma_build/doc/doxygen'
>>make[3]: Entering directory `/usr/src/rtai-magma_build/doc'
>>make[3]: Nothing to be done for `all-am'.
>>make[3]: Leaving directory `/usr/src/rtai-magma_build/doc'
>>make[2]: Leaving directory `/usr/src/rtai-magma_build/doc'
>>Making all in testsuite
>>make[2]: Entering directory `/usr/src/rtai-magma_build/testsuite'
>>Making all in kern
>>make[3]: Entering directory `/usr/src/rtai-magma_build/testsuite/kern'
>>Making all in latency
>>make[4]: Entering directory `/usr/src/rtai-magma_build/testsuite/kern/latency'
>>if gcc -DHAVE_CONFIG_H -I. -I/usr/src/rtai_src/testsuite/kern/latency -I../../..  -O2 -I/usr/src/linux/include  -Wall -Wstrict-prototypes -pipe -D__IN_RTAI__ -I/usr/src/rtai_src/base/include -I../../../base/include    -MT display-display.o -MD -MP -MF ".deps/display-display.Tpo" -c -o display-display.o `test -f 'display.c' || echo '/usr/src/rtai_src/testsuite/kern/latency/'`display.c; \
>>	then mv -f ".deps/display-display.Tpo" ".deps/display-display.Po"; else rm -f ".deps/display-display.Tpo"; exit 1; fi
>>/bin/sh ../../../libtool --tag=CC --mode=link gcc     -o display  display-display.o  
>>mkdir .libs
>>gcc -o display display-display.o 
>>make[5]: Entering directory `/usr/src/linux-2.6.19.7'
>>
>>  WARNING: Symbol version dump /usr/src/linux-2.6.19.7/Module.symvers
>>           is missing; modules will have no dependencies and modversions.
>>
>>  CC [M]  /usr/src/rtai_build/testsuite/kern/latency/latency-module.o
>>In file included from /usr/src/rtai_build/testsuite/kern/latency/../../../base/include/asm/rtai.h:20,
>>                 from /usr/src/rtai_build/testsuite/kern/latency/latency-module.c:27:
>>/usr/src/rtai_build/testsuite/kern/latency/../../../base/include/asm/rtai_hal.h:487: warning: type qualifiers ignored on function return type
>>/usr/src/rtai_build/testsuite/kern/latency/../../../base/include/asm/rtai_hal.h:493: warning: type qualifiers ignored on function return type
>>  LD [M]  /usr/src/rtai_build/testsuite/kern/latency/latency_rt.o
>>  Building modules, stage 2.
>>  MODPOST 1 modules
>>  CC      /usr/src/rtai_build/testsuite/kern/latency/latency_rt.mod.o
>>  LD [M]  /usr/src/rtai_build/testsuite/kern/latency/latency_rt.ko
>>make[5]: Leaving directory `/usr/src/linux-2.6.19.7'
>>make[4]: Leaving directory `/usr/src/rtai-magma_build/testsuite/kern/latency'
>>Making all in preempt
>>make[4]: Entering directory `/usr/src/rtai-magma_build/testsuite/kern/preempt'
>>if gcc -DHAVE_CONFIG_H -I. -I/usr/src/rtai_src/testsuite/kern/preempt -I../../..  -O2 -I/usr/src/linux/include  -Wall -Wstrict-prototypes -pipe -D__IN_RTAI__ -I/usr/src/rtai_src/base/include -I../../../base/include    -MT display-display.o -MD -MP -MF ".deps/display-display.Tpo" -c -o display-display.o `test -f 'display.c' || echo '/usr/src/rtai_src/testsuite/kern/preempt/'`display.c; \
>>	then mv -f ".deps/display-display.Tpo" ".deps/display-display.Po"; else rm -f ".deps/display-display.Tpo"; exit 1; fi
>>/bin/sh ../../../libtool --tag=CC --mode=link gcc     -o display  display-display.o  
>>mkdir .libs
>>gcc -o display display-display.o 
>>make[5]: Entering directory `/usr/src/linux-2.6.19.7'
>>
>>  WARNING: Symbol version dump /usr/src/linux-2.6.19.7/Module.symvers
>>           is missing; modules will have no dependencies and modversions.
>>
>>  CC [M]  /usr/src/rtai_build/testsuite/kern/preempt/preempt-module.o
>>In file included from /usr/src/rtai_build/testsuite/kern/preempt/../../../base/include/asm/rtai.h:20,
>>                 from /usr/src/rtai_src/base/include/rtai.h:25,
>>                 from /usr/src/rtai_build/testsuite/kern/preempt/preempt-module.c:24:
>>/usr/src/rtai_build/testsuite/kern/preempt/../../../base/include/asm/rtai_hal.h:487: warning: type qualifiers ignored on function return type
>>/usr/src/rtai_build/testsuite/kern/preempt/../../../base/include/asm/rtai_hal.h:493: warning: type qualifiers ignored on function return type
>>/usr/src/rtai_build/testsuite/kern/preempt/preempt-module.c: In function ‘fun’:
>>/usr/src/rtai_build/testsuite/kern/preempt/preempt-module.c:97: warning: unused variable ‘t’
>>  LD [M]  /usr/src/rtai_build/testsuite/kern/preempt/preempt_rt.o
>>  Building modules, stage 2.
>>  MODPOST 1 modules
>>  CC      /usr/src/rtai_build/testsuite/kern/preempt/preempt_rt.mod.o
>>  LD [M]  /usr/src/rtai_build/testsuite/kern/preempt/preempt_rt.ko
>>make[5]: Leaving directory `/usr/src/linux-2.6.19.7'
>>make[4]: Leaving directory `/usr/src/rtai-magma_build/testsuite/kern/preempt'
>>Making all in switches
>>make[4]: Entering directory `/usr/src/rtai-magma_build/testsuite/kern/switches'
>>make[5]: Entering directory `/usr/src/linux-2.6.19.7'
>>
>>  WARNING: Symbol version dump /usr/src/linux-2.6.19.7/Module.symvers
>>           is missing; modules will have no dependencies and modversions.
>>
>>  CC [M]  /usr/src/rtai_build/testsuite/kern/switches/switches-module.o
>>In file included from /usr/src/rtai_build/testsuite/kern/switches/../../../base/include/asm/rtai.h:20,
>>                 from /usr/src/rtai_src/base/include/rtai.h:25,
>>                 from /usr/src/rtai_src/base/include/rtai_sched.h:22,
>>                 from /usr/src/rtai_src/base/include/rtai_sem.h:29,
>>                 from /usr/src/rtai_build/testsuite/kern/switches/switches-module.c:23:
>>/usr/src/rtai_build/testsuite/kern/switches/../../../base/include/asm/rtai_hal.h:487: warning: type qualifiers ignored on function return type
>>/usr/src/rtai_build/testsuite/kern/switches/../../../base/include/asm/rtai_hal.h:493: warning: type qualifiers ignored on function return type
>>  LD [M]  /usr/src/rtai_build/testsuite/kern/switches/switches_rt.o
>>  Building modules, stage 2.
>>  MODPOST 1 modules
>>  CC      /usr/src/rtai_build/testsuite/kern/switches/switches_rt.mod.o
>>  LD [M]  /usr/src/rtai_build/testsuite/kern/switches/switches_rt.ko
>>make[5]: Leaving directory `/usr/src/linux-2.6.19.7'
>>make[4]: Leaving directory `/usr/src/rtai-magma_build/testsuite/kern/switches'
>>make[4]: Entering directory `/usr/src/rtai-magma_build/testsuite/kern'
>>make[4]: Nothing to be done for `all-am'.
>>make[4]: Leaving directory `/usr/src/rtai-magma_build/testsuite/kern'
>>make[3]: Leaving directory `/usr/src/rtai-magma_build/testsuite/kern'
>>Making all in user
>>make[3]: Entering directory `/usr/src/rtai-magma_build/testsuite/user'
>>Making all in latency
>>make[4]: Entering directory `/usr/src/rtai-magma_build/testsuite/user/latency'
>>if gcc -DHAVE_CONFIG_H -I. -I/usr/src/rtai_src/testsuite/user/latency -I../../..  -O2 -I/usr/src/linux/include  -Wall -Wstrict-prototypes -pipe -D__IN_RTAI__ -I/usr/src/rtai_src/base/include -I../../../base/include    -MT latency-latency.o -MD -MP -MF ".deps/latency-latency.Tpo" -c -o latency-latency.o `test -f 'latency.c' || echo '/usr/src/rtai_src/testsuite/user/latency/'`latency.c; \
>>	then mv -f ".deps/latency-latency.Tpo" ".deps/latency-latency.Po"; else rm -f ".deps/latency-latency.Tpo"; exit 1; fi
>>/bin/sh ../../../libtool --tag=CC --mode=link gcc     -o latency  latency-latency.o ../../../base/sched/liblxrt/liblxrt.la -lpthread 
>>mkdir .libs
>>
>>*** Warning: Linking the executable latency against the loadable module
>>*** liblxrt.so is not portable!
>>gcc -o .libs/latency latency-latency.o  ../../../base/sched/liblxrt/.libs/liblxrt.so -lpthread -Wl,--rpath -Wl,/usr/src/rtai_install/lib
>>creating latency
>>if gcc -DHAVE_CONFIG_H -I. -I/usr/src/rtai_src/testsuite/user/latency -I../../..  -O2 -I/usr/src/linux/include  -Wall -Wstrict-prototypes -pipe -D__IN_RTAI__ -I/usr/src/rtai_src/base/include -I../../../base/include    -MT display-display.o -MD -MP -MF ".deps/display-display.Tpo" -c -o display-display.o `test -f 'display.c' || echo '/usr/src/rtai_src/testsuite/user/latency/'`display.c; \
>>	then mv -f ".deps/display-display.Tpo" ".deps/display-display.Po"; else rm -f ".deps/display-display.Tpo"; exit 1; fi
>>/bin/sh ../../../libtool --tag=CC --mode=link gcc     -o display  display-display.o ../../../base/sched/liblxrt/liblxrt.la -lpthread 
>>
>>*** Warning: Linking the executable display against the loadable module
>>*** liblxrt.so is not portable!
>>gcc -o .libs/display display-display.o  ../../../base/sched/liblxrt/.libs/liblxrt.so -lpthread -Wl,--rpath -Wl,/usr/src/rtai_install/lib
>>creating display
>>make[4]: Leaving directory `/usr/src/rtai-magma_build/testsuite/user/latency'
>>Making all in preempt
>>make[4]: Entering directory `/usr/src/rtai-magma_build/testsuite/user/preempt'
>>if gcc -DHAVE_CONFIG_H -I. -I/usr/src/rtai_src/testsuite/user/preempt -I../../..  -O2 -I/usr/src/linux/include  -Wall -Wstrict-prototypes -pipe -D__IN_RTAI__ -I/usr/src/rtai_src/base/include -I../../../base/include    -MT preempt-preempt.o -MD -MP -MF ".deps/preempt-preempt.Tpo" -c -o preempt-preempt.o `test -f 'preempt.c' || echo '/usr/src/rtai_src/testsuite/user/preempt/'`preempt.c; \
>>	then mv -f ".deps/preempt-preempt.Tpo" ".deps/preempt-preempt.Po"; else rm -f ".deps/preempt-preempt.Tpo"; exit 1; fi
>>/bin/sh ../../../libtool --tag=CC --mode=link gcc     -o preempt  preempt-preempt.o ../../../base/sched/liblxrt/liblxrt.la -lpthread 
>>mkdir .libs
>>
>>*** Warning: Linking the executable preempt against the loadable module
>>*** liblxrt.so is not portable!
>>gcc -o .libs/preempt preempt-preempt.o  ../../../base/sched/liblxrt/.libs/liblxrt.so -lpthread -Wl,--rpath -Wl,/usr/src/rtai_install/lib
>>creating preempt
>>if gcc -DHAVE_CONFIG_H -I. -I/usr/src/rtai_src/testsuite/user/preempt -I../../..  -O2 -I/usr/src/linux/include  -Wall -Wstrict-prototypes -pipe -D__IN_RTAI__ -I/usr/src/rtai_src/base/include -I../../../base/include    -MT display-display.o -MD -MP -MF ".deps/display-display.Tpo" -c -o display-display.o `test -f 'display.c' || echo '/usr/src/rtai_src/testsuite/user/preempt/'`display.c; \
>>	then mv -f ".deps/display-display.Tpo" ".deps/display-display.Po"; else rm -f ".deps/display-display.Tpo"; exit 1; fi
>>/bin/sh ../../../libtool --tag=CC --mode=link gcc     -o display  display-display.o ../../../base/sched/liblxrt/liblxrt.la -lpthread 
>>
>>*** Warning: Linking the executable display against the loadable module
>>*** liblxrt.so is not portable!
>>gcc -o .libs/display display-display.o  ../../../base/sched/liblxrt/.libs/liblxrt.so -lpthread -Wl,--rpath -Wl,/usr/src/rtai_install/lib
>>creating display
>>make[4]: Leaving directory `/usr/src/rtai-magma_build/testsuite/user/preempt'
>>Making all in switches
>>make[4]: Entering directory `/usr/src/rtai-magma_build/testsuite/user/switches'
>>if gcc -DHAVE_CONFIG_H -I. -I/usr/src/rtai_src/testsuite/user/switches -I../../..  -O2 -I/usr/src/linux/include  -Wall -Wstrict-prototypes -pipe -D__IN_RTAI__ -I/usr/src/rtai_src/base/include -I../../../base/include    -MT switches-switches.o -MD -MP -MF ".deps/switches-switches.Tpo" -c -o switches-switches.o `test -f 'switches.c' || echo '/usr/src/rtai_src/testsuite/user/switches/'`switches.c; \
>>	then mv -f ".deps/switches-switches.Tpo" ".deps/switches-switches.Po"; else rm -f ".deps/switches-switches.Tpo"; exit 1; fi
>>/bin/sh ../../../libtool --tag=CC --mode=link gcc     -o switches  switches-switches.o ../../../base/sched/liblxrt/liblxrt.la -lpthread 
>>mkdir .libs
>>
>>*** Warning: Linking the executable switches against the loadable module
>>*** liblxrt.so is not portable!
>>gcc -o .libs/switches switches-switches.o  ../../../base/sched/liblxrt/.libs/liblxrt.so -lpthread -Wl,--rpath -Wl,/usr/src/rtai_install/lib
>>creating switches
>>make[4]: Leaving directory `/usr/src/rtai-magma_build/testsuite/user/switches'
>>make[4]: Entering directory `/usr/src/rtai-magma_build/testsuite/user'
>>make[4]: Nothing to be done for `all-am'.
>>make[4]: Leaving directory `/usr/src/rtai-magma_build/testsuite/user'
>>make[3]: Leaving directory `/usr/src/rtai-magma_build/testsuite/user'
>>make[3]: Entering directory `/usr/src/rtai-magma_build/testsuite'
>>make[3]: Nothing to be done for `all-am'.
>>make[3]: Leaving directory `/usr/src/rtai-magma_build/testsuite'
>>make[2]: Leaving directory `/usr/src/rtai-magma_build/testsuite'
>>make[2]: Entering directory `/usr/src/rtai-magma_build'
>>make[2]: Nothing to be done for `all-am'.
>>make[2]: Leaving directory `/usr/src/rtai-magma_build'
>>make[1]: Leaving directory `/usr/src/rtai-magma_build'
>>
>>]0;root at sc2hawaii:/usr/src/rtai_build[root at sc2hawaii rtai_build]# make install
>>Making install in base
>>make[1]: Entering directory `/usr/src/rtai-magma_build/base'
>>Making install in include
>>make[2]: Entering directory `/usr/src/rtai-magma_build/base/include'
>>Making install in asm-x86_64
>>make[3]: Entering directory `/usr/src/rtai-magma_build/base/include/asm-x86_64'
>>make[4]: Entering directory `/usr/src/rtai-magma_build/base/include/asm-x86_64'
>>make[4]: Nothing to be done for `install-exec-am'.
>>/bin/sh /usr/src/rtai_src/base/config/autoconf/mkinstalldirs /usr/src/rtai_install/include/asm-x86_64
>>mkdir -p -- /usr/src/rtai_install/include/asm-x86_64
>>rm -f /usr/src/rtai_install/include/asm-x86_64/../asm
>>ln -s asm-x86_64 /usr/src/rtai_install/include/asm-x86_64/../asm
>>test -z "/usr/src/rtai_install/include/asm-x86_64" || mkdir -p -- "/usr/src/rtai_install/include/asm-x86_64"
>> /usr/bin/install -c -m 644 '/usr/src/rtai_src/base/include/asm-x86_64/rtai.h' '/usr/src/rtai_install/include/asm-x86_64/rtai.h'
>> /usr/bin/install -c -m 644 '/usr/src/rtai_src/base/include/asm-x86_64/rtai_atomic.h' '/usr/src/rtai_install/include/asm-x86_64/rtai_atomic.h'
>> /usr/bin/install -c -m 644 '/usr/src/rtai_src/base/include/asm-x86_64/rtai_fpu.h' '/usr/src/rtai_install/include/asm-x86_64/rtai_fpu.h'
>> /usr/bin/install -c -m 644 '/usr/src/rtai_src/base/include/asm-x86_64/rtai_hal.h' '/usr/src/rtai_install/include/asm-x86_64/rtai_hal.h'
>> /usr/bin/install -c -m 644 '/usr/src/rtai_src/base/include/asm-x86_64/rtai_emulate_tsc.h' '/usr/src/rtai_install/include/asm-x86_64/rtai_emulate_tsc.h'
>> /usr/bin/install -c -m 644 '/usr/src/rtai_src/base/include/asm-x86_64/rtai_leds.h' '/usr/src/rtai_install/include/asm-x86_64/rtai_leds.h'
>> /usr/bin/install -c -m 644 '/usr/src/rtai_src/base/include/asm-x86_64/rtai_lxrt.h' '/usr/src/rtai_install/include/asm-x86_64/rtai_lxrt.h'
>> /usr/bin/install -c -m 644 '/usr/src/rtai_src/base/include/asm-x86_64/rtai_oldnames.h' '/usr/src/rtai_install/include/asm-x86_64/rtai_oldnames.h'
>> /usr/bin/install -c -m 644 '/usr/src/rtai_src/base/include/asm-x86_64/rtai_sched.h' '/usr/src/rtai_install/include/asm-x86_64/rtai_sched.h'
>> /usr/bin/install -c -m 644 '/usr/src/rtai_src/base/include/asm-x86_64/rtai_shm.h' '/usr/src/rtai_install/include/asm-x86_64/rtai_shm.h'
>> /usr/bin/install -c -m 644 '/usr/src/rtai_src/base/include/asm-x86_64/rtai_srq.h' '/usr/src/rtai_install/include/asm-x86_64/rtai_srq.h'
>> /usr/bin/install -c -m 644 '/usr/src/rtai_src/base/include/asm-x86_64/rtai_usi.h' '/usr/src/rtai_install/include/asm-x86_64/rtai_usi.h'
>> /usr/bin/install -c -m 644 '/usr/src/rtai_src/base/include/asm-x86_64/rtai_vectors.h' '/usr/src/rtai_install/include/asm-x86_64/rtai_vectors.h'
>>make[4]: Leaving directory `/usr/src/rtai-magma_build/base/include/asm-x86_64'
>>make[3]: Leaving directory `/usr/src/rtai-magma_build/base/include/asm-x86_64'
>>make[3]: Entering directory `/usr/src/rtai-magma_build/base/include'
>>make[4]: Entering directory `/usr/src/rtai-magma_build/base/include'
>>make[4]: Nothing to be done for `install-exec-am'.
>>/usr/bin/install -c -m 644 ../../rtai_config.h /usr/src/rtai_install/include/rtai_config.h
>>test -z "/usr/src/rtai_install/include" || mkdir -p -- "/usr/src/rtai_install/include"
>> /usr/src/rtai_src/base/config/autoconf/install-sh -c -m 644 '/usr/src/rtai_src/base/include/rtai.h' '/usr/src/rtai_install/include/rtai.h'
>> /usr/src/rtai_src/base/config/autoconf/install-sh -c -m 644 '/usr/src/rtai_src/base/include/rtai_hal_names.h' '/usr/src/rtai_install/include/rtai_hal_names.h'
>> /usr/src/rtai_src/base/config/autoconf/install-sh -c -m 644 '/usr/src/rtai_src/base/include/rtai_bits.h' '/usr/src/rtai_install/include/rtai_bits.h'
>> /usr/src/rtai_src/base/config/autoconf/install-sh -c -m 644 '/usr/src/rtai_src/base/include/rtai_fifos.h' '/usr/src/rtai_install/include/rtai_fifos.h'
>> /usr/src/rtai_src/base/config/autoconf/install-sh -c -m 644 '/usr/src/rtai_src/base/include/rtai_leds.h' '/usr/src/rtai_install/include/rtai_leds.h'
>> /usr/src/rtai_src/base/config/autoconf/install-sh -c -m 644 '/usr/src/rtai_src/base/include/rtai_lxrt.h' '/usr/src/rtai_install/include/rtai_lxrt.h'
>> /usr/src/rtai_src/base/config/autoconf/install-sh -c -m 644 '/usr/src/rtai_src/base/include/rtai_malloc.h' '/usr/src/rtai_install/include/rtai_malloc.h'
>> /usr/src/rtai_src/base/config/autoconf/install-sh -c -m 644 '/usr/src/rtai_src/base/include/rtai_math.h' '/usr/src/rtai_install/include/rtai_math.h'
>> /usr/src/rtai_src/base/config/autoconf/install-sh -c -m 644 '/usr/src/rtai_src/base/include/rtai_mbx.h' '/usr/src/rtai_install/include/rtai_mbx.h'
>> /usr/src/rtai_src/base/config/autoconf/install-sh -c -m 644 '/usr/src/rtai_src/base/include/rtai_mq.h' '/usr/src/rtai_install/include/rtai_mq.h'
>> /usr/src/rtai_src/base/config/autoconf/install-sh -c -m 644 '/usr/src/rtai_src/base/include/rtai_msg.h' '/usr/src/rtai_install/include/rtai_msg.h'
>> /usr/src/rtai_src/base/config/autoconf/install-sh -c -m 644 '/usr/src/rtai_src/base/include/rtai_nam2num.h' '/usr/src/rtai_install/include/rtai_nam2num.h'
>> /usr/src/rtai_src/base/config/autoconf/install-sh -c -m 644 '/usr/src/rtai_src/base/include/rtai_names.h' '/usr/src/rtai_install/include/rtai_names.h'
>> /usr/src/rtai_src/base/config/autoconf/install-sh -c -m 644 '/usr/src/rtai_src/base/include/rtai_netrpc.h' '/usr/src/rtai_install/include/rtai_netrpc.h'
>> /usr/src/rtai_src/base/config/autoconf/install-sh -c -m 644 '/usr/src/rtai_src/base/include/rtai_pmq.h' '/usr/src/rtai_install/include/rtai_pmq.h'
>> /usr/src/rtai_src/base/config/autoconf/install-sh -c -m 644 '/usr/src/rtai_src/base/include/rtai_posix.h' '/usr/src/rtai_install/include/rtai_posix.h'
>> /usr/src/rtai_src/base/config/autoconf/install-sh -c -m 644 '/usr/src/rtai_src/base/include/rtai_prinher.h' '/usr/src/rtai_install/include/rtai_prinher.h'
>> /usr/src/rtai_src/base/config/autoconf/install-sh -c -m 644 '/usr/src/rtai_src/base/include/rtai_proc_fs.h' '/usr/src/rtai_install/include/rtai_proc_fs.h'
>> /usr/src/rtai_src/base/config/autoconf/install-sh -c -m 644 '/usr/src/rtai_src/base/include/rtai_proxies.h' '/usr/src/rtai_install/include/rtai_proxies.h'
>> /usr/src/rtai_src/base/config/autoconf/install-sh -c -m 644 '/usr/src/rtai_src/base/include/rtai_registry.h' '/usr/src/rtai_install/include/rtai_registry.h'
>> /usr/src/rtai_src/base/config/autoconf/install-sh -c -m 644 '/usr/src/rtai_src/base/include/rtai_rwl.h' '/usr/src/rtai_install/include/rtai_rwl.h'
>> /usr/src/rtai_src/base/config/autoconf/install-sh -c -m 644 '/usr/src/rtai_src/base/include/rtai_sanity.h' '/usr/src/rtai_install/include/rtai_sanity.h'
>> /usr/src/rtai_src/base/config/autoconf/install-sh -c -m 644 '/usr/src/rtai_src/base/include/rtai_scb.h' '/usr/src/rtai_install/include/rtai_scb.h'
>> /usr/src/rtai_src/base/config/autoconf/install-sh -c -m 644 '/usr/src/rtai_src/base/include/rtai_sched.h' '/usr/src/rtai_install/include/rtai_sched.h'
>> /usr/src/rtai_src/base/config/autoconf/install-sh -c -m 644 '/usr/src/rtai_src/base/include/rtai_schedcore.h' '/usr/src/rtai_install/include/rtai_schedcore.h'
>> /usr/src/rtai_src/base/config/autoconf/install-sh -c -m 644 '/usr/src/rtai_src/base/include/rtai_sem.h' '/usr/src/rtai_install/include/rtai_sem.h'
>> /usr/src/rtai_src/base/config/autoconf/install-sh -c -m 644 '/usr/src/rtai_src/base/include/rtai_shm.h' '/usr/src/rtai_install/include/rtai_shm.h'
>> /usr/src/rtai_src/base/config/autoconf/install-sh -c -m 644 '/usr/src/rtai_src/base/include/rtai_signal.h' '/usr/src/rtai_install/include/rtai_signal.h'
>> /usr/src/rtai_src/base/config/autoconf/install-sh -c -m 644 '/usr/src/rtai_src/base/include/rtai_spl.h' '/usr/src/rtai_install/include/rtai_spl.h'
>> /usr/src/rtai_src/base/config/autoconf/install-sh -c -m 644 '/usr/src/rtai_src/base/include/rtai_tasklets.h' '/usr/src/rtai_install/include/rtai_tasklets.h'
>> /usr/src/rtai_src/base/config/autoconf/install-sh -c -m 644 '/usr/src/rtai_src/base/include/rtai_tbx.h' '/usr/src/rtai_install/include/rtai_tbx.h'
>> /usr/src/rtai_src/base/config/autoconf/install-sh -c -m 644 '/usr/src/rtai_src/base/include/rtai_trace.h' '/usr/src/rtai_install/include/rtai_trace.h'
>> /usr/src/rtai_src/base/config/autoconf/install-sh -c -m 644 '/usr/src/rtai_src/base/include/rtai_types.h' '/usr/src/rtai_install/include/rtai_types.h'
>> /usr/src/rtai_src/base/config/autoconf/install-sh -c -m 644 '/usr/src/rtai_src/base/include/rtai_usi.h' '/usr/src/rtai_install/include/rtai_usi.h'
>> /usr/src/rtai_src/base/config/autoconf/install-sh -c -m 644 '/usr/src/rtai_src/base/include/rtai_version.h' '/usr/src/rtai_install/include/rtai_version.h'
>> /usr/src/rtai_src/base/config/autoconf/install-sh -c -m 644 '/usr/src/rtai_src/base/include/rtai_wd.h' '/usr/src/rtai_install/include/rtai_wd.h'
>> /usr/src/rtai_src/base/config/autoconf/install-sh -c -m 644 '/usr/src/rtai_src/base/include/rtai_wrappers.h' '/usr/src/rtai_install/include/rtai_wrappers.h'
>>make[4]: Leaving directory `/usr/src/rtai-magma_build/base/include'
>>make[3]: Leaving directory `/usr/src/rtai-magma_build/base/include'
>>make[2]: Leaving directory `/usr/src/rtai-magma_build/base/include'
>>Making install in ipc
>>make[2]: Entering directory `/usr/src/rtai-magma_build/base/ipc'
>>Making install in bits
>>make[3]: Entering directory `/usr/src/rtai-magma_build/base/ipc/bits'
>>make[4]: Entering directory `/usr/src/rtai-magma_build/base/ipc/bits'
>>/bin/sh /usr/src/rtai_src/base/config/autoconf/mkinstalldirs /usr/src/rtai_install/modules
>>mkdir -p -- /usr/src/rtai_install/modules
>>/usr/bin/install -c -m 644 rtai_bits.ko /usr/src/rtai_install/modules
>>make[4]: Nothing to be done for `install-data-am'.
>>make[4]: Leaving directory `/usr/src/rtai-magma_build/base/ipc/bits'
>>make[3]: Leaving directory `/usr/src/rtai-magma_build/base/ipc/bits'
>>Making install in fifos
>>make[3]: Entering directory `/usr/src/rtai-magma_build/base/ipc/fifos'
>>make[4]: Entering directory `/usr/src/rtai-magma_build/base/ipc/fifos'
>>/bin/sh /usr/src/rtai_src/base/config/autoconf/mkinstalldirs /usr/src/rtai_install/modules
>>/usr/bin/install -c -m 644 rtai_fifos.ko /usr/src/rtai_install/modules
>>make[4]: Nothing to be done for `install-data-am'.
>>make[4]: Leaving directory `/usr/src/rtai-magma_build/base/ipc/fifos'
>>make[3]: Leaving directory `/usr/src/rtai-magma_build/base/ipc/fifos'
>>Making install in netrpc
>>make[3]: Entering directory `/usr/src/rtai-magma_build/base/ipc/netrpc'
>>make[4]: Entering directory `/usr/src/rtai-magma_build/base/ipc/netrpc'
>>/bin/sh /usr/src/rtai_src/base/config/autoconf/mkinstalldirs /usr/src/rtai_install/modules
>>/usr/bin/install -c -m 644 rtai_netrpc.ko /usr/src/rtai_install/modules
>>make[4]: Nothing to be done for `install-data-am'.
>>make[4]: Leaving directory `/usr/src/rtai-magma_build/base/ipc/netrpc'
>>make[3]: Leaving directory `/usr/src/rtai-magma_build/base/ipc/netrpc'
>>Making install in shm
>>make[3]: Entering directory `/usr/src/rtai-magma_build/base/ipc/shm'
>>make[4]: Entering directory `/usr/src/rtai-magma_build/base/ipc/shm'
>>/bin/sh /usr/src/rtai_src/base/config/autoconf/mkinstalldirs /usr/src/rtai_install/modules
>>/usr/bin/install -c -m 644 rtai_shm.ko /usr/src/rtai_install/modules
>>make[4]: Nothing to be done for `install-data-am'.
>>make[4]: Leaving directory `/usr/src/rtai-magma_build/base/ipc/shm'
>>make[3]: Leaving directory `/usr/src/rtai-magma_build/base/ipc/shm'
>>Making install in sem
>>make[3]: Entering directory `/usr/src/rtai-magma_build/base/ipc/sem'
>>make[4]: Entering directory `/usr/src/rtai-magma_build/base/ipc/sem'
>>/bin/sh /usr/src/rtai_src/base/config/autoconf/mkinstalldirs /usr/src/rtai_install/modules
>>/usr/bin/install -c -m 644 rtai_sem.ko /usr/src/rtai_install/modules
>>make[4]: Nothing to be done for `install-data-am'.
>>make[4]: Leaving directory `/usr/src/rtai-magma_build/base/ipc/sem'
>>make[3]: Leaving directory `/usr/src/rtai-magma_build/base/ipc/sem'
>>Making install in msg
>>make[3]: Entering directory `/usr/src/rtai-magma_build/base/ipc/msg'
>>make[4]: Entering directory `/usr/src/rtai-magma_build/base/ipc/msg'
>>/bin/sh /usr/src/rtai_src/base/config/autoconf/mkinstalldirs /usr/src/rtai_install/modules
>>/usr/bin/install -c -m 644 rtai_msg.ko /usr/src/rtai_install/modules
>>make[4]: Nothing to be done for `install-data-am'.
>>make[4]: Leaving directory `/usr/src/rtai-magma_build/base/ipc/msg'
>>make[3]: Leaving directory `/usr/src/rtai-magma_build/base/ipc/msg'
>>Making install in mbx
>>make[3]: Entering directory `/usr/src/rtai-magma_build/base/ipc/mbx'
>>make[4]: Entering directory `/usr/src/rtai-magma_build/base/ipc/mbx'
>>/bin/sh /usr/src/rtai_src/base/config/autoconf/mkinstalldirs /usr/src/rtai_install/modules
>>/usr/bin/install -c -m 644 rtai_mbx.ko /usr/src/rtai_install/modules
>>make[4]: Nothing to be done for `install-data-am'.
>>make[4]: Leaving directory `/usr/src/rtai-magma_build/base/ipc/mbx'
>>make[3]: Leaving directory `/usr/src/rtai-magma_build/base/ipc/mbx'
>>Making install in tbx
>>make[3]: Entering directory `/usr/src/rtai-magma_build/base/ipc/tbx'
>>make[4]: Entering directory `/usr/src/rtai-magma_build/base/ipc/tbx'
>>/bin/sh /usr/src/rtai_src/base/config/autoconf/mkinstalldirs /usr/src/rtai_install/modules
>>/usr/bin/install -c -m 644 rtai_tbx.ko /usr/src/rtai_install/modules
>>make[4]: Nothing to be done for `install-data-am'.
>>make[4]: Leaving directory `/usr/src/rtai-magma_build/base/ipc/tbx'
>>make[3]: Leaving directory `/usr/src/rtai-magma_build/base/ipc/tbx'
>>Making install in mq
>>make[3]: Entering directory `/usr/src/rtai-magma_build/base/ipc/mq'
>>make[4]: Entering directory `/usr/src/rtai-magma_build/base/ipc/mq'
>>/bin/sh /usr/src/rtai_src/base/config/autoconf/mkinstalldirs /usr/src/rtai_install/modules
>>/usr/bin/install -c -m 644 rtai_mq.ko /usr/src/rtai_install/modules
>>make[4]: Nothing to be done for `install-data-am'.
>>make[4]: Leaving directory `/usr/src/rtai-magma_build/base/ipc/mq'
>>make[3]: Leaving directory `/usr/src/rtai-magma_build/base/ipc/mq'
>>make[3]: Entering directory `/usr/src/rtai-magma_build/base/ipc'
>>make[4]: Entering directory `/usr/src/rtai-magma_build/base/ipc'
>>make[4]: Nothing to be done for `install-exec-am'.
>>make[4]: Nothing to be done for `install-data-am'.
>>make[4]: Leaving directory `/usr/src/rtai-magma_build/base/ipc'
>>make[3]: Leaving directory `/usr/src/rtai-magma_build/base/ipc'
>>make[2]: Leaving directory `/usr/src/rtai-magma_build/base/ipc'
>>Making install in malloc
>>make[2]: Entering directory `/usr/src/rtai-magma_build/base/malloc'
>>make[3]: Entering directory `/usr/src/rtai-magma_build/base/malloc'
>>make[3]: Nothing to be done for `install-exec-am'.
>>make[3]: Nothing to be done for `install-data-am'.
>>make[3]: Leaving directory `/usr/src/rtai-magma_build/base/malloc'
>>make[2]: Leaving directory `/usr/src/rtai-magma_build/base/malloc'
>>Making install in tasklets
>>make[2]: Entering directory `/usr/src/rtai-magma_build/base/tasklets'
>>make[3]: Entering directory `/usr/src/rtai-magma_build/base/tasklets'
>>/bin/sh /usr/src/rtai_src/base/config/autoconf/mkinstalldirs /usr/src/rtai_install/modules
>>/usr/bin/install -c -m 644 rtai_tasklets.ko rtai_signal.ko /usr/src/rtai_install/modules
>>make[3]: Nothing to be done for `install-data-am'.
>>make[3]: Leaving directory `/usr/src/rtai-magma_build/base/tasklets'
>>make[2]: Leaving directory `/usr/src/rtai-magma_build/base/tasklets'
>>Making install in usi
>>make[2]: Entering directory `/usr/src/rtai-magma_build/base/usi'
>>make[3]: Entering directory `/usr/src/rtai-magma_build/base/usi'
>>/bin/sh /usr/src/rtai_src/base/config/autoconf/mkinstalldirs /usr/src/rtai_install/modules
>>/usr/bin/install -c -m 644 rtai_usi.ko /usr/src/rtai_install/modules
>>make[3]: Nothing to be done for `install-data-am'.
>>make[3]: Leaving directory `/usr/src/rtai-magma_build/base/usi'
>>make[2]: Leaving directory `/usr/src/rtai-magma_build/base/usi'
>>Making install in wd
>>make[2]: Entering directory `/usr/src/rtai-magma_build/base/wd'
>>make[3]: Entering directory `/usr/src/rtai-magma_build/base/wd'
>>/bin/sh /usr/src/rtai_src/base/config/autoconf/mkinstalldirs /usr/src/rtai_install/modules
>>/usr/bin/install -c -m 644 rtai_wd.ko /usr/src/rtai_install/modules
>>make[3]: Nothing to be done for `install-data-am'.
>>make[3]: Leaving directory `/usr/src/rtai-magma_build/base/wd'
>>make[2]: Leaving directory `/usr/src/rtai-magma_build/base/wd'
>>Making install in sched
>>make[2]: Entering directory `/usr/src/rtai-magma_build/base/sched'
>>Making install in liblxrt
>>make[3]: Entering directory `/usr/src/rtai-magma_build/base/sched/liblxrt'
>>make[4]: Entering directory `/usr/src/rtai-magma_build/base/sched/liblxrt'
>>test -z "/usr/src/rtai_install/lib" || mkdir -p -- "/usr/src/rtai_install/lib"
>> /bin/sh ../../../libtool --mode=install /usr/bin/install -c  'liblxrt.la' '/usr/src/rtai_install/lib/liblxrt.la'
>>/usr/bin/install -c .libs/liblxrt.so.1.0.0 /usr/src/rtai_install/lib/liblxrt.so.1.0.0
>>(cd /usr/src/rtai_install/lib && rm -f liblxrt.so.1 && ln -s liblxrt.so.1.0.0 liblxrt.so.1)
>>(cd /usr/src/rtai_install/lib && rm -f liblxrt.so && ln -s liblxrt.so.1.0.0 liblxrt.so)
>>/usr/bin/install -c .libs/liblxrt.lai /usr/src/rtai_install/lib/liblxrt.la
>>/usr/bin/install -c .libs/liblxrt.a /usr/src/rtai_install/lib/liblxrt.a
>>chmod 644 /usr/src/rtai_install/lib/liblxrt.a
>>ranlib /usr/src/rtai_install/lib/liblxrt.a
>>PATH="$PATH:/sbin" ldconfig -n /usr/src/rtai_install/lib
>>----------------------------------------------------------------------
>>Libraries have been installed in:
>>   /usr/src/rtai_install/lib
>>
>>If you ever happen to want to link against installed libraries
>>in a given directory, LIBDIR, you must either use libtool, and
>>specify the full pathname of the library, or use the `-LLIBDIR'
>>flag during linking and do at least one of the following:
>>   - add LIBDIR to the `LD_LIBRARY_PATH' environment variable
>>     during execution
>>   - add LIBDIR to the `LD_RUN_PATH' environment variable
>>     during linking
>>   - use the `-Wl,--rpath -Wl,LIBDIR' linker flag
>>   - have your system administrator add LIBDIR to `/etc/ld.so.conf'
>>
>>See any operating system documentation about shared libraries for
>>more information, such as the ld(1) and ld.so(8) manual pages.
>>----------------------------------------------------------------------
>>make[4]: Nothing to be done for `install-data-am'.
>>make[4]: Leaving directory `/usr/src/rtai-magma_build/base/sched/liblxrt'
>>make[3]: Leaving directory `/usr/src/rtai-magma_build/base/sched/liblxrt'
>>make[3]: Entering directory `/usr/src/rtai-magma_build/base/sched'
>>make[4]: Entering directory `/usr/src/rtai-magma_build/base/sched'
>>/bin/sh /usr/src/rtai_src/base/config/autoconf/mkinstalldirs /usr/src/rtai_install/modules
>>/usr/bin/install -c -m 644  rtai_lxrt.ko /usr/src/rtai_install/modules
>>for s in up mup smp ksched sched ; do \
>>		rm -f /usr/src/rtai_install/modules/rtai_$s.ko ; \
>>		ln -s rtai_lxrt.ko /usr/src/rtai_install/modules/rtai_$s.ko ; \
>>	done
>>make[4]: Nothing to be done for `install-data-am'.
>>make[4]: Leaving directory `/usr/src/rtai-magma_build/base/sched'
>>make[3]: Leaving directory `/usr/src/rtai-magma_build/base/sched'
>>make[2]: Leaving directory `/usr/src/rtai-magma_build/base/sched'
>>Making install in arch
>>make[2]: Entering directory `/usr/src/rtai-magma_build/base/arch'
>>Making install in x86_64
>>make[3]: Entering directory `/usr/src/rtai-magma_build/base/arch/x86_64'
>>Making install in hal
>>make[4]: Entering directory `/usr/src/rtai-magma_build/base/arch/x86_64/hal'
>>make[5]: Entering directory `/usr/src/rtai-magma_build/base/arch/x86_64/hal'
>>/bin/sh /usr/src/rtai_src/base/config/autoconf/mkinstalldirs /usr/src/rtai_install/modules
>>/usr/bin/install -c -m 644 rtai_hal.ko /usr/src/rtai_install/modules
>>make[5]: Nothing to be done for `install-data-am'.
>>make[5]: Leaving directory `/usr/src/rtai-magma_build/base/arch/x86_64/hal'
>>make[4]: Leaving directory `/usr/src/rtai-magma_build/base/arch/x86_64/hal'
>>Making install in calibration
>>make[4]: Entering directory `/usr/src/rtai-magma_build/base/arch/x86_64/calibration'
>>make[5]: Entering directory `/usr/src/rtai-magma_build/base/arch/x86_64/calibration'
>>/bin/sh /usr/src/rtai_src/base/config/autoconf/mkinstalldirs /usr/src/rtai_install/modules
>>/usr/bin/install -c -m 644 calibrate_rt.ko /usr/src/rtai_install/modules/rtai_calibrate.ko
>>test -z "/usr/src/rtai_install/calibration" || mkdir -p -- "/usr/src/rtai_install/calibration"
>>  /bin/sh ../../../../libtool --mode=install /usr/bin/install -c 'calibrate' '/usr/src/rtai_install/calibration/calibrate'
>>/usr/bin/install -c calibrate /usr/src/rtai_install/calibration/calibrate
>>  /bin/sh ../../../../libtool --mode=install /usr/bin/install -c 'calibration_helper' '/usr/src/rtai_install/calibration/calibration_helper'
>>/usr/bin/install -c .libs/calibration_helper /usr/src/rtai_install/calibration/calibration_helper
>>/bin/sh /usr/src/rtai_src/base/config/autoconf/mkinstalldirs /usr/src/rtai_install/calibration
>>/usr/bin/install -c -m 644 /usr/src/rtai_src/base/arch/x86_64/calibration/runinfo /usr/src/rtai_install/calibration/.runinfo
>>make[5]: Leaving directory `/usr/src/rtai-magma_build/base/arch/x86_64/calibration'
>>make[4]: Leaving directory `/usr/src/rtai-magma_build/base/arch/x86_64/calibration'
>>make[4]: Entering directory `/usr/src/rtai-magma_build/base/arch/x86_64'
>>make[5]: Entering directory `/usr/src/rtai-magma_build/base/arch/x86_64'
>>make[5]: Nothing to be done for `install-exec-am'.
>>make[5]: Nothing to be done for `install-data-am'.
>>make[5]: Leaving directory `/usr/src/rtai-magma_build/base/arch/x86_64'
>>make[4]: Leaving directory `/usr/src/rtai-magma_build/base/arch/x86_64'
>>make[3]: Leaving directory `/usr/src/rtai-magma_build/base/arch/x86_64'
>>make[3]: Entering directory `/usr/src/rtai-magma_build/base/arch'
>>make[4]: Entering directory `/usr/src/rtai-magma_build/base/arch'
>>make[4]: Nothing to be done for `install-exec-am'.
>>make[4]: Nothing to be done for `install-data-am'.
>>make[4]: Leaving directory `/usr/src/rtai-magma_build/base/arch'
>>make[3]: Leaving directory `/usr/src/rtai-magma_build/base/arch'
>>make[2]: Leaving directory `/usr/src/rtai-magma_build/base/arch'
>>Making install in scripts
>>make[2]: Entering directory `/usr/src/rtai-magma_build/base/scripts'
>>make[3]: Entering directory `/usr/src/rtai-magma_build/base/scripts'
>>/bin/sh /usr/src/rtai_src/base/config/autoconf/mkinstalldirs /usr/src/rtai_install/bin
>>mkdir -p -- /usr/src/rtai_install/bin
>>/usr/bin/install -c rtai-load /usr/src/rtai_install/bin
>>/usr/bin/install -c rtai-config /usr/src/rtai_install/bin
>>/usr/bin/install -c /usr/src/rtai_src/base/scripts/rtai-info /usr/src/rtai_install/bin
>>make[3]: Nothing to be done for `install-data-am'.
>>make[3]: Leaving directory `/usr/src/rtai-magma_build/base/scripts'
>>make[2]: Leaving directory `/usr/src/rtai-magma_build/base/scripts'
>>Making install in posix
>>make[2]: Entering directory `/usr/src/rtai-magma_build/base/posix'
>>make[3]: Entering directory `/usr/src/rtai-magma_build/base/posix'
>>make[3]: Nothing to be done for `install-exec-am'.
>>make[3]: Nothing to be done for `install-data-am'.
>>make[3]: Leaving directory `/usr/src/rtai-magma_build/base/posix'
>>make[2]: Leaving directory `/usr/src/rtai-magma_build/base/posix'
>>make[2]: Entering directory `/usr/src/rtai-magma_build/base'
>>make[3]: Entering directory `/usr/src/rtai-magma_build/base'
>>make[3]: Nothing to be done for `install-exec-am'.
>>make[3]: Nothing to be done for `install-data-am'.
>>make[3]: Leaving directory `/usr/src/rtai-magma_build/base'
>>make[2]: Leaving directory `/usr/src/rtai-magma_build/base'
>>make[1]: Leaving directory `/usr/src/rtai-magma_build/base'
>>Making install in doc
>>make[1]: Entering directory `/usr/src/rtai-magma_build/doc'
>>Making install in docbook
>>make[2]: Entering directory `/usr/src/rtai-magma_build/doc/docbook'
>>Making install in custom-stylesheets
>>make[3]: Entering directory `/usr/src/rtai-magma_build/doc/docbook/custom-stylesheets'
>>Making install in xsl
>>make[4]: Entering directory `/usr/src/rtai-magma_build/doc/docbook/custom-stylesheets/xsl'
>>Making install in common
>>make[5]: Entering directory `/usr/src/rtai-magma_build/doc/docbook/custom-stylesheets/xsl/common'
>>make[6]: Entering directory `/usr/src/rtai-magma_build/doc/docbook/custom-stylesheets/xsl/common'
>>make[6]: Nothing to be done for `install-exec-am'.
>>make[6]: Nothing to be done for `install-data-am'.
>>make[6]: Leaving directory `/usr/src/rtai-magma_build/doc/docbook/custom-stylesheets/xsl/common'
>>make[5]: Leaving directory `/usr/src/rtai-magma_build/doc/docbook/custom-stylesheets/xsl/common'
>>Making install in fo
>>make[5]: Entering directory `/usr/src/rtai-magma_build/doc/docbook/custom-stylesheets/xsl/fo'
>>make[6]: Entering directory `/usr/src/rtai-magma_build/doc/docbook/custom-stylesheets/xsl/fo'
>>make[6]: Nothing to be done for `install-exec-am'.
>>make[6]: Nothing to be done for `install-data-am'.
>>make[6]: Leaving directory `/usr/src/rtai-magma_build/doc/docbook/custom-stylesheets/xsl/fo'
>>make[5]: Leaving directory `/usr/src/rtai-magma_build/doc/docbook/custom-stylesheets/xsl/fo'
>>Making install in html
>>make[5]: Entering directory `/usr/src/rtai-magma_build/doc/docbook/custom-stylesheets/xsl/html'
>>make[6]: Entering directory `/usr/src/rtai-magma_build/doc/docbook/custom-stylesheets/xsl/html'
>>make[6]: Nothing to be done for `install-exec-am'.
>>docs=""; \
>>	for dir in $docs; do \
>>	    dest=/usr/src/rtai_install/share/doc/rtai-magma/html/`basename $dir`; \
>>	    /bin/sh /usr/src/rtai_src/base/config/autoconf/mkinstalldirs $dest; \
>>	    abs_dest=`cd $dest && pwd` ; \
>>            pushd $dir; \
>>	    for f in * ; do \
>>	        case $f in \
>>		    *~|CVS|[mM]akefile*|GNUmakefile*);; \
>>		    *.html|*.htm) cat $f > $abs_dest/$f;; \
>>		    *) /usr/bin/install -c -m 644 $f $abs_dest/$f;; \
>>	        esac; \
>>	    done; \
>>	    popd; \
>>	done
>>docs=""; \
>>	for dir in $docs; do \
>>	    dest=/usr/src/rtai_install/share/doc/rtai-magma/html/`basename $dir`; \
>>	    /bin/sh /usr/src/rtai_src/base/config/autoconf/mkinstalldirs $dest; \
>>	    abs_dest=`cd $dest && pwd` ; \
>>            pushd $dir; \
>>	    for f in * ; do \
>>	        case $f in \
>>		    *~|CVS|[mM]akefile*|GNUmakefile*);; \
>>		    *) /usr/bin/install -c -m 644 $f $abs_dest/$f;; \
>>	        esac; \
>>	    done; \
>>	    popd; \
>>	done
>>docs=""; dest=/usr/src/rtai_install/share/doc/rtai-magma/ps; \
>>	/bin/sh /usr/src/rtai_src/base/config/autoconf/mkinstalldirs $dest && \
>>	for f in $docs; do \
>>	    /usr/bin/install -c -m 644 $f $dest; \
>>	done
>>mkdir -p -- /usr/src/rtai_install/share/doc/rtai-magma/ps
>>docs=""; dest=/usr/src/rtai_install/share/doc/rtai-magma/pdf; \
>>	/bin/sh /usr/src/rtai_src/base/config/autoconf/mkinstalldirs $dest && \
>>	for f in $docs; do \
>>	    /usr/bin/install -c -m 644 $f $dest; \
>>	done
>>mkdir -p -- /usr/src/rtai_install/share/doc/rtai-magma/pdf
>>make[6]: Leaving directory `/usr/src/rtai-magma_build/doc/docbook/custom-stylesheets/xsl/html'
>>make[5]: Leaving directory `/usr/src/rtai-magma_build/doc/docbook/custom-stylesheets/xsl/html'
>>make[5]: Entering directory `/usr/src/rtai-magma_build/doc/docbook/custom-stylesheets/xsl'
>>make[6]: Entering directory `/usr/src/rtai-magma_build/doc/docbook/custom-stylesheets/xsl'
>>make[6]: Nothing to be done for `install-exec-am'.
>>make[6]: Nothing to be done for `install-data-am'.
>>make[6]: Leaving directory `/usr/src/rtai-magma_build/doc/docbook/custom-stylesheets/xsl'
>>make[5]: Leaving directory `/usr/src/rtai-magma_build/doc/docbook/custom-stylesheets/xsl'
>>make[4]: Leaving directory `/usr/src/rtai-magma_build/doc/docbook/custom-stylesheets/xsl'
>>make[4]: Entering directory `/usr/src/rtai-magma_build/doc/docbook/custom-stylesheets'
>>make[5]: Entering directory `/usr/src/rtai-magma_build/doc/docbook/custom-stylesheets'
>>make[5]: Nothing to be done for `install-exec-am'.
>>make[5]: Nothing to be done for `install-data-am'.
>>make[5]: Leaving directory `/usr/src/rtai-magma_build/doc/docbook/custom-stylesheets'
>>make[4]: Leaving directory `/usr/src/rtai-magma_build/doc/docbook/custom-stylesheets'
>>make[3]: Leaving directory `/usr/src/rtai-magma_build/doc/docbook/custom-stylesheets'
>>Making install in docbook-test
>>make[3]: Entering directory `/usr/src/rtai-magma_build/doc/docbook/docbook-test'
>>make[4]: Entering directory `/usr/src/rtai-magma_build/doc/docbook/docbook-test'
>>make[4]: Nothing to be done for `install-exec-am'.
>>docs=""; \
>>	for dir in $docs; do \
>>	    dest=/usr/src/rtai_install/share/doc/rtai-magma/html/`basename $dir`; \
>>	    /bin/sh /usr/src/rtai_src/base/config/autoconf/mkinstalldirs $dest; \
>>	    abs_dest=`cd $dest && pwd` ; \
>>            pushd $dir; \
>>	    for f in * ; do \
>>	        case $f in \
>>		    *~|CVS|[mM]akefile*|GNUmakefile*);; \
>>		    *.html|*.htm) cat $f > $abs_dest/$f;; \
>>		    *) /usr/bin/install -c -m 644 $f $abs_dest/$f;; \
>>	        esac; \
>>	    done; \
>>	    popd; \
>>	done
>>docs=""; \
>>	for dir in $docs; do \
>>	    dest=/usr/src/rtai_install/share/doc/rtai-magma/html/`basename $dir`; \
>>	    /bin/sh /usr/src/rtai_src/base/config/autoconf/mkinstalldirs $dest; \
>>	    abs_dest=`cd $dest && pwd` ; \
>>            pushd $dir; \
>>	    for f in * ; do \
>>	        case $f in \
>>		    *~|CVS|[mM]akefile*|GNUmakefile*);; \
>>		    *) /usr/bin/install -c -m 644 $f $abs_dest/$f;; \
>>	        esac; \
>>	    done; \
>>	    popd; \
>>	done
>>docs=""; dest=/usr/src/rtai_install/share/doc/rtai-magma/ps; \
>>	/bin/sh /usr/src/rtai_src/base/config/autoconf/mkinstalldirs $dest && \
>>	for f in $docs; do \
>>	    /usr/bin/install -c -m 644 $f $dest; \
>>	done
>>docs=""; dest=/usr/src/rtai_install/share/doc/rtai-magma/pdf; \
>>	/bin/sh /usr/src/rtai_src/base/config/autoconf/mkinstalldirs $dest && \
>>	for f in $docs; do \
>>	    /usr/bin/install -c -m 644 $f $dest; \
>>	done
>>make[4]: Leaving directory `/usr/src/rtai-magma_build/doc/docbook/docbook-test'
>>make[3]: Leaving directory `/usr/src/rtai-magma_build/doc/docbook/docbook-test'
>>make[3]: Entering directory `/usr/src/rtai-magma_build/doc/docbook'
>>make[4]: Entering directory `/usr/src/rtai-magma_build/doc/docbook'
>>make[4]: Nothing to be done for `install-exec-am'.
>>docs="/usr/src/rtai_src/doc/generated/html/css /usr/src/rtai_src/doc/generated/html/pictures"; \
>>	for dir in $docs; do \
>>	    dest=/usr/src/rtai_install/share/doc/rtai-magma/html/`basename $dir`; \
>>	    /bin/sh /usr/src/rtai_src/base/config/autoconf/mkinstalldirs $dest; \
>>	    abs_dest=`cd $dest && pwd` ; \
>>            pushd $dir; \
>>	    for f in * ; do \
>>	        case $f in \
>>		    *~|CVS|[mM]akefile*|GNUmakefile*);; \
>>		    *.html|*.htm) cat $f > $abs_dest/$f;; \
>>		    *) /usr/bin/install -c -m 644 $f $abs_dest/$f;; \
>>	        esac; \
>>	    done; \
>>	    popd; \
>>	done
>>mkdir -p -- /usr/src/rtai_install/share/doc/rtai-magma/html/css
>>/usr/src/rtai_src/doc/generated/html/css /usr/src/rtai_build/doc/docbook
>>/usr/src/rtai_build/doc/docbook
>>mkdir -p -- /usr/src/rtai_install/share/doc/rtai-magma/html/pictures
>>/usr/src/rtai_src/doc/generated/html/pictures /usr/src/rtai_build/doc/docbook
>>/usr/src/rtai_build/doc/docbook
>>docs=""; \
>>	for dir in $docs; do \
>>	    dest=/usr/src/rtai_install/share/doc/rtai-magma/html/`basename $dir`; \
>>	    /bin/sh /usr/src/rtai_src/base/config/autoconf/mkinstalldirs $dest; \
>>	    abs_dest=`cd $dest && pwd` ; \
>>            pushd $dir; \
>>	    for f in * ; do \
>>	        case $f in \
>>		    *~|CVS|[mM]akefile*|GNUmakefile*);; \
>>		    *) /usr/bin/install -c -m 644 $f $abs_dest/$f;; \
>>	        esac; \
>>	    done; \
>>	    popd; \
>>	done
>>docs=""; dest=/usr/src/rtai_install/share/doc/rtai-magma/ps; \
>>	/bin/sh /usr/src/rtai_src/base/config/autoconf/mkinstalldirs $dest && \
>>	for f in $docs; do \
>>	    /usr/bin/install -c -m 644 $f $dest; \
>>	done
>>docs=""; dest=/usr/src/rtai_install/share/doc/rtai-magma/pdf; \
>>	/bin/sh /usr/src/rtai_src/base/config/autoconf/mkinstalldirs $dest && \
>>	for f in $docs; do \
>>	    /usr/bin/install -c -m 644 $f $dest; \
>>	done
>>make[4]: Leaving directory `/usr/src/rtai-magma_build/doc/docbook'
>>make[3]: Leaving directory `/usr/src/rtai-magma_build/doc/docbook'
>>make[2]: Leaving directory `/usr/src/rtai-magma_build/doc/docbook'
>>Making install in doxygen
>>make[2]: Entering directory `/usr/src/rtai-magma_build/doc/doxygen'
>>make[3]: Entering directory `/usr/src/rtai-magma_build/doc/doxygen'
>>make[3]: Nothing to be done for `install-exec-am'.
>>docs="/usr/src/rtai_src/doc/doxygen/../generated/html/api"; \
>>	for dir in $docs; do \
>>	    dest=/usr/src/rtai_install/share/doc/rtai-magma/html/`basename $dir`; \
>>	    /bin/sh /usr/src/rtai_src/base/config/autoconf/mkinstalldirs $dest; \
>>	    abs_dest=`cd $dest && pwd` ; \
>>            pushd $dir; \
>>	    for f in * ; do \
>>	        case $f in \
>>		    *~|CVS|[mM]akefile*|GNUmakefile*);; \
>>		    *) /usr/bin/install -c -m 644 $f $abs_dest/$f;; \
>>	        esac; \
>>	    done; \
>>	    popd; \
>>	done
>>mkdir -p -- /usr/src/rtai_install/share/doc/rtai-magma/html/api
>>/usr/src/rtai_src/doc/generated/html/api /usr/src/rtai_build/doc/doxygen
>>/usr/src/rtai_build/doc/doxygen
>>docs=""; dest=/usr/src/rtai_install/share/doc/rtai-magma/ps; \
>>	/bin/sh /usr/src/rtai_src/base/config/autoconf/mkinstalldirs $dest && \
>>	for f in $docs; do \
>>	    /usr/bin/install -c -m 644 $f $dest; \
>>	done
>>docs=""; dest=/usr/src/rtai_install/share/doc/rtai-magma/pdf; \
>>	/bin/sh /usr/src/rtai_src/base/config/autoconf/mkinstalldirs $dest && \
>>	for f in $docs; do \
>>	    /usr/bin/install -c -m 644 $f $dest; \
>>	done
>>make[3]: Leaving directory `/usr/src/rtai-magma_build/doc/doxygen'
>>make[2]: Leaving directory `/usr/src/rtai-magma_build/doc/doxygen'
>>make[2]: Entering directory `/usr/src/rtai-magma_build/doc'
>>make[3]: Entering directory `/usr/src/rtai-magma_build/doc'
>>make[3]: Nothing to be done for `install-exec-am'.
>>make[3]: Nothing to be done for `install-data-am'.
>>make[3]: Leaving directory `/usr/src/rtai-magma_build/doc'
>>make[2]: Leaving directory `/usr/src/rtai-magma_build/doc'
>>make[1]: Leaving directory `/usr/src/rtai-magma_build/doc'
>>Making install in testsuite
>>make[1]: Entering directory `/usr/src/rtai-magma_build/testsuite'
>>Making install in kern
>>make[2]: Entering directory `/usr/src/rtai-magma_build/testsuite/kern'
>>Making install in latency
>>make[3]: Entering directory `/usr/src/rtai-magma_build/testsuite/kern/latency'
>>make[4]: Entering directory `/usr/src/rtai-magma_build/testsuite/kern/latency'
>>/bin/sh /usr/src/rtai_src/base/config/autoconf/mkinstalldirs /usr/src/rtai_install/testsuite/kern/latency
>>mkdir -p -- /usr/src/rtai_install/testsuite/kern/latency
>>/usr/bin/install -c -m 644 latency_rt.ko /usr/src/rtai_install/testsuite/kern/latency
>>/bin/sh /usr/src/rtai_src/base/config/autoconf/mkinstalldirs /usr/src/rtai_install/testsuite/kern/latency
>>/usr/bin/install -c -m 644 /usr/src/rtai_src/testsuite/kern/latency/runinfo /usr/src/rtai_install/testsuite/kern/latency/.runinfo
>>test -z "/usr/src/rtai_install/testsuite/kern/latency" || mkdir -p -- "/usr/src/rtai_install/testsuite/kern/latency"
>>  /bin/sh ../../../libtool --mode=install /usr/bin/install -c 'display' '/usr/src/rtai_install/testsuite/kern/latency/display'
>>/usr/bin/install -c display /usr/src/rtai_install/testsuite/kern/latency/display
>>make[4]: Leaving directory `/usr/src/rtai-magma_build/testsuite/kern/latency'
>>make[3]: Leaving directory `/usr/src/rtai-magma_build/testsuite/kern/latency'
>>Making install in preempt
>>make[3]: Entering directory `/usr/src/rtai-magma_build/testsuite/kern/preempt'
>>make[4]: Entering directory `/usr/src/rtai-magma_build/testsuite/kern/preempt'
>>/bin/sh /usr/src/rtai_src/base/config/autoconf/mkinstalldirs /usr/src/rtai_install/testsuite/kern/preempt
>>mkdir -p -- /usr/src/rtai_install/testsuite/kern/preempt
>>/usr/bin/install -c -m 644 preempt_rt.ko /usr/src/rtai_install/testsuite/kern/preempt
>>/bin/sh /usr/src/rtai_src/base/config/autoconf/mkinstalldirs /usr/src/rtai_install/testsuite/kern/preempt
>>/usr/bin/install -c -m 644 /usr/src/rtai_src/testsuite/kern/preempt/runinfo /usr/src/rtai_install/testsuite/kern/preempt/.runinfo
>>test -z "/usr/src/rtai_install/testsuite/kern/preempt" || mkdir -p -- "/usr/src/rtai_install/testsuite/kern/preempt"
>>  /bin/sh ../../../libtool --mode=install /usr/bin/install -c 'display' '/usr/src/rtai_install/testsuite/kern/preempt/display'
>>/usr/bin/install -c display /usr/src/rtai_install/testsuite/kern/preempt/display
>>make[4]: Leaving directory `/usr/src/rtai-magma_build/testsuite/kern/preempt'
>>make[3]: Leaving directory `/usr/src/rtai-magma_build/testsuite/kern/preempt'
>>Making install in switches
>>make[3]: Entering directory `/usr/src/rtai-magma_build/testsuite/kern/switches'
>>make[4]: Entering directory `/usr/src/rtai-magma_build/testsuite/kern/switches'
>>/bin/sh /usr/src/rtai_src/base/config/autoconf/mkinstalldirs /usr/src/rtai_install/testsuite/kern/switches
>>mkdir -p -- /usr/src/rtai_install/testsuite/kern/switches
>>/usr/bin/install -c -m 644 switches_rt.ko /usr/src/rtai_install/testsuite/kern/switches
>>/bin/sh /usr/src/rtai_src/base/config/autoconf/mkinstalldirs /usr/src/rtai_install/testsuite/kern/switches
>>/usr/bin/install -c -m 644 /usr/src/rtai_src/testsuite/kern/switches/runinfo /usr/src/rtai_install/testsuite/kern/switches/.runinfo
>>make[4]: Leaving directory `/usr/src/rtai-magma_build/testsuite/kern/switches'
>>make[3]: Leaving directory `/usr/src/rtai-magma_build/testsuite/kern/switches'
>>make[3]: Entering directory `/usr/src/rtai-magma_build/testsuite/kern'
>>make[4]: Entering directory `/usr/src/rtai-magma_build/testsuite/kern'
>>make[4]: Nothing to be done for `install-exec-am'.
>>make[4]: Nothing to be done for `install-data-am'.
>>make[4]: Leaving directory `/usr/src/rtai-magma_build/testsuite/kern'
>>make[3]: Leaving directory `/usr/src/rtai-magma_build/testsuite/kern'
>>make[2]: Leaving directory `/usr/src/rtai-magma_build/testsuite/kern'
>>Making install in user
>>make[2]: Entering directory `/usr/src/rtai-magma_build/testsuite/user'
>>Making install in latency
>>make[3]: Entering directory `/usr/src/rtai-magma_build/testsuite/user/latency'
>>make[4]: Entering directory `/usr/src/rtai-magma_build/testsuite/user/latency'
>>make[4]: Nothing to be done for `install-exec-am'.
>>/bin/sh /usr/src/rtai_src/base/config/autoconf/mkinstalldirs /usr/src/rtai_install/testsuite/user/latency
>>mkdir -p -- /usr/src/rtai_install/testsuite/user/latency
>>/usr/bin/install -c -m 644 /usr/src/rtai_src/testsuite/user/latency/runinfo /usr/src/rtai_install/testsuite/user/latency/.runinfo
>>test -z "/usr/src/rtai_install/testsuite/user/latency" || mkdir -p -- "/usr/src/rtai_install/testsuite/user/latency"
>>  /bin/sh ../../../libtool --mode=install /usr/bin/install -c 'latency' '/usr/src/rtai_install/testsuite/user/latency/latency'
>>/usr/bin/install -c .libs/latency /usr/src/rtai_install/testsuite/user/latency/latency
>>  /bin/sh ../../../libtool --mode=install /usr/bin/install -c 'display' '/usr/src/rtai_install/testsuite/user/latency/display'
>>/usr/bin/install -c .libs/display /usr/src/rtai_install/testsuite/user/latency/display
>>make[4]: Leaving directory `/usr/src/rtai-magma_build/testsuite/user/latency'
>>make[3]: Leaving directory `/usr/src/rtai-magma_build/testsuite/user/latency'
>>Making install in preempt
>>make[3]: Entering directory `/usr/src/rtai-magma_build/testsuite/user/preempt'
>>make[4]: Entering directory `/usr/src/rtai-magma_build/testsuite/user/preempt'
>>make[4]: Nothing to be done for `install-exec-am'.
>>/bin/sh /usr/src/rtai_src/base/config/autoconf/mkinstalldirs /usr/src/rtai_install/testsuite/user/preempt
>>mkdir -p -- /usr/src/rtai_install/testsuite/user/preempt
>>/usr/bin/install -c -m 644 /usr/src/rtai_src/testsuite/user/preempt/runinfo /usr/src/rtai_install/testsuite/user/preempt/.runinfo
>>test -z "/usr/src/rtai_install/testsuite/user/preempt" || mkdir -p -- "/usr/src/rtai_install/testsuite/user/preempt"
>>  /bin/sh ../../../libtool --mode=install /usr/bin/install -c 'preempt' '/usr/src/rtai_install/testsuite/user/preempt/preempt'
>>/usr/bin/install -c .libs/preempt /usr/src/rtai_install/testsuite/user/preempt/preempt
>>  /bin/sh ../../../libtool --mode=install /usr/bin/install -c 'display' '/usr/src/rtai_install/testsuite/user/preempt/display'
>>/usr/bin/install -c .libs/display /usr/src/rtai_install/testsuite/user/preempt/display
>>make[4]: Leaving directory `/usr/src/rtai-magma_build/testsuite/user/preempt'
>>make[3]: Leaving directory `/usr/src/rtai-magma_build/testsuite/user/preempt'
>>Making install in switches
>>make[3]: Entering directory `/usr/src/rtai-magma_build/testsuite/user/switches'
>>make[4]: Entering directory `/usr/src/rtai-magma_build/testsuite/user/switches'
>>make[4]: Nothing to be done for `install-exec-am'.
>>/bin/sh /usr/src/rtai_src/base/config/autoconf/mkinstalldirs /usr/src/rtai_install/testsuite/user/switches
>>mkdir -p -- /usr/src/rtai_install/testsuite/user/switches
>>/usr/bin/install -c -m 644 /usr/src/rtai_src/testsuite/user/switches/runinfo /usr/src/rtai_install/testsuite/user/switches/.runinfo
>>test -z "/usr/src/rtai_install/testsuite/user/switches" || mkdir -p -- "/usr/src/rtai_install/testsuite/user/switches"
>>  /bin/sh ../../../libtool --mode=install /usr/bin/install -c 'switches' '/usr/src/rtai_install/testsuite/user/switches/switches'
>>/usr/bin/install -c .libs/switches /usr/src/rtai_install/testsuite/user/switches/switches
>>make[4]: Leaving directory `/usr/src/rtai-magma_build/testsuite/user/switches'
>>make[3]: Leaving directory `/usr/src/rtai-magma_build/testsuite/user/switches'
>>make[3]: Entering directory `/usr/src/rtai-magma_build/testsuite/user'
>>make[4]: Entering directory `/usr/src/rtai-magma_build/testsuite/user'
>>make[4]: Nothing to be done for `install-exec-am'.
>>make[4]: Nothing to be done for `install-data-am'.
>>make[4]: Leaving directory `/usr/src/rtai-magma_build/testsuite/user'
>>make[3]: Leaving directory `/usr/src/rtai-magma_build/testsuite/user'
>>make[2]: Leaving directory `/usr/src/rtai-magma_build/testsuite/user'
>>make[2]: Entering directory `/usr/src/rtai-magma_build/testsuite'
>>make[3]: Entering directory `/usr/src/rtai-magma_build/testsuite'
>>make[3]: Nothing to be done for `install-exec-am'.
>>make[3]: Nothing to be done for `install-data-am'.
>>make[3]: Leaving directory `/usr/src/rtai-magma_build/testsuite'
>>make[2]: Leaving directory `/usr/src/rtai-magma_build/testsuite'
>>make[1]: Leaving directory `/usr/src/rtai-magma_build/testsuite'
>>make[1]: Entering directory `/usr/src/rtai-magma_build'
>>make[2]: Entering directory `/usr/src/rtai-magma_build'
>>/bin/sh /usr/src/rtai_src/base/config/autoconf/mkinstalldirs /usr/src/rtai_install/share/rtai
>>mkdir -p -- /usr/src/rtai_install/share/rtai
>>/usr/bin/install -c -m 644 .rtai_config /usr/src/rtai_install/share/rtai/config-rtai-magma
>>make[2]: Leaving directory `/usr/src/rtai-magma_build'
>>make[1]: Leaving directory `/usr/src/rtai-magma_build'
>>]0;root at sc2hawaii:/usr/src/rtai_build[root at sc2hawaii rtai_build]# exit
>>
>>Script done on Thu 15 Mar 2007 02:17:10 PM GMT






More information about the Rtai mailing list